Build failed in Jenkins: jujugui-test-charm #333

Jenkins Notification devnull at canonical.com
Fri Apr 19 18:06:41 UTC 2013


See <http://10.189.74.2:8080/job/jujugui-test-charm/333/changes>

Changes:

[Brad Crittenden] Fix config update.

The call to set_config was not passing the proper parameters resulting in
the callback not happening.  A test has been added to ensure the two
optional parameters are passed properly to ensure this doesn't
happen again.

R=jeff.pihach, teknico
CC=
https://codereview.appspot.com/8702045

------------------------------------------
Started by an SCM change
[EnvInject] - Loading node environment variables.
Building remotely on lp-quantal-server-amd64
$ bzr revision-info -d <http://10.189.74.2:8080/job/jujugui-test-charm/ws/>
info result: bzr revision-info -d <http://10.189.74.2:8080/job/jujugui-test-charm/ws/> returned 0. Command output: "585 rick.harding at canonical.com-20130419171337-zh5guua47ei6rpbr
" stderr: ""
[jujugui-test-charm] $ bzr pull --overwrite lp:juju-gui
You have not informed bzr of your Launchpad ID, and you must do this to
write to Launchpad or access private data.  See "bzr help launchpad-login".
http://bazaar.launchpad.net/~juju-gui/juju-gui/trunk is permanently redirected to http://bazaar.launchpad.net/~juju-gui/juju-gui/trunk/changes
You have not informed bzr of your Launchpad ID, and you must do this to
write to Launchpad or access private data.  See "bzr help launchpad-login".
 M  app/app.js
 M  app/store/env/go.js
 M  app/store/env/python.js
 M  app/views/service.js
 M  lib/views/stylesheet.less
 M  test/test_env_go.js
 M  test/test_env_python.js
 M  test/test_service_config_view.js
All changes applied successfully.
Now on revision 586.
[jujugui-test-charm] $ bzr revert
$ bzr revision-info -d <http://10.189.74.2:8080/job/jujugui-test-charm/ws/>
info result: bzr revision-info -d <http://10.189.74.2:8080/job/jujugui-test-charm/ws/> returned 0. Command output: "586 bac at canonical.com-20130419174327-rs79f3tqaoi0k7cw
" stderr: ""
[jujugui-test-charm] $ bzr log -v -r revid:rick.harding at canonical.com-20130419171337-zh5guua47ei6rpbr..revid:bac at canonical.com-20130419174327-rs79f3tqaoi0k7cw --long --show-ids
Getting local revision...
$ bzr revision-info -d <http://10.189.74.2:8080/job/jujugui-test-charm/ws/>
info result: bzr revision-info -d <http://10.189.74.2:8080/job/jujugui-test-charm/ws/> returned 0. Command output: "586 bac at canonical.com-20130419174327-rs79f3tqaoi0k7cw
" stderr: ""
RevisionState revno:586 revid:bac at canonical.com-20130419174327-rs79f3tqaoi0k7cw
[EnvInject] - Injecting environment variables from a build step.
[EnvInject] - Injecting as environment variables the properties content 
JUJU_INSTANCE_IP=91.189.93.93
JUJU_BRANCH=lp:juju-gui
JUJU_CHARM=cs:~juju-gui/precise/juju-gui
FAIL_FAST=1
JUJU_GUI_TEST_BROWSERS=ie chrome firefox

[EnvInject] - Variables injected successfully.
[jujugui-test-charm] $ /bin/sh -xe /tmp/hudson1791196617748196561.sh
+ set -ex
+ cat
+ chmod +x /tmp/test-runner
+ sudo -E su -p -c /tmp/test-runner - jujugui-merger
Clean and Prep
2013-04-19 17:45:42,115 INFO Destroying environment 'juju-gui-testing' (type: openstack)...
2013-04-19 17:45:45,229 INFO 'destroy_environment' command finished successfully
WARNING: this command will destroy the 'juju-gui-testing' environment (type: openstack).
This includes all machines, services, data, and other resources. Continue [y/N] 
Waiting for instances to terminate
Lightweight Checkout of lp:juju-gui
You have not informed bzr of your Launchpad ID, and you must do this to
write to Launchpad or access private data.  See "bzr help launchpad-login".
JUJU_INSTANCE_IP=91.189.93.93
Running Tests
ADDRESS	91.189.93.93	i-00007a44
Bootstrapping...
Deploying service...
Setting origin for charm to deploy lp:juju-gui
Waiting for service to start...
Assigning JUJU_INSTANCE_IP 91.189.93.93
Storing Internal IP as 10.55.60.41
Assigned IP to i-00007a44
Exposing the service...
2013-04-19 17:58:48,779 INFO Connecting to environment...
2013-04-19 17:58:51,410 INFO Connected to environment.
2013-04-19 17:58:53,412 INFO 'status' command finished successfully
APP_URL= http://91.189.93.93
Launching ie tests.
test_environment_connection (__main__.TestBasics) ... ok
test_environment_name (__main__.TestBasics) ... ok
test_gui_unit_tests (__main__.TestBasics) ... ok
test_title (__main__.TestBasics) ... ok
test_charm_deploy (__main__.TestDeploy) ... ok
test_staging_services (__main__.TestDeploy) ... ok

----------------------------------------------------------------------
Ran 6 tests in 175.575s

OK
Browser: ie
Test run details at https://saucelabs.com/jobs/1e7dd8a07e0746798ff50bb6cd90de24
restart_api with ip:10.55.60.41
Launching chrome tests.
test_environment_connection (__main__.TestBasics) ... ok
test_environment_name (__main__.TestBasics) ... ok
test_gui_unit_tests (__main__.TestBasics) ... ok
test_title (__main__.TestBasics) ... ok
test_charm_deploy (__main__.TestDeploy) ... ok
test_staging_services (__main__.TestDeploy) ... ok

----------------------------------------------------------------------
Ran 6 tests in 127.945s

OK
Browser: chrome
Test run details at https://saucelabs.com/jobs/e7a8adbb2834431db6602443ac7c3f35
restart_api with ip:10.55.60.41
Launching firefox tests.
test_environment_connection (__main__.TestBasics) ... ok
test_environment_name (__main__.TestBasics) ... ok
test_gui_unit_tests (__main__.TestBasics) ... FAIL
test_title (__main__.TestBasics) ... ok
test_charm_deploy (__main__.TestDeploy) ... ok
test_staging_services (__main__.TestDeploy) ... ok

======================================================================
FAIL: test_gui_unit_tests (__main__.TestBasics)
----------------------------------------------------------------------
Traceback (most recent call last):
  File "test/test_charm_running.py", line 72, in test_gui_unit_tests
    self.fail(msg)
AssertionError: 1 failure(s) running 84 tests.

----------------------------------------------------------------------
Ran 6 tests in 161.600s

FAILED (failures=1)
Browser: firefox
Test run details at https://saucelabs.com/jobs/06c1a0ca581a438f9510ca3ac81f7465
2 failure(s) running 98 tests.  Retrying.
2 failure(s) running 89 tests.  Retrying.
2 failure(s) running 95 tests.  Retrying.
1 failure(s) running 85 tests.  Retrying.
restart_api with ip:10.55.60.41
Collected exit code 1
Final instance state
i-00007a43 running i-00007a44 running
+ cat /home/jujugui-merger/exit-status
+ ec=1
+ [ 0 -eq 1 ]
+ wc -l
+ cat /home/jujugui-merger/instance-state
+ [ 2 -lt 2 ]
+ wc -l
+ grep error\|stopped
+ cat /home/jujugui-merger/instance-state
+ [ 0 -gt 0 ]
+ exit 1
Build step 'Execute shell' marked build as failure



More information about the Juju-GUI mailing list