Build failed in Jenkins: jujugui-test-charm #331

Jenkins Notification devnull at canonical.com
Fri Apr 19 15:17:06 UTC 2013


See <http://10.189.74.2:8080/job/jujugui-test-charm/331/changes>

Changes:

[Brad Crittenden] Fix 'Settings' link on Service view.

R=frankban, gary.poster
CC=
https://codereview.appspot.com/8854043

------------------------------------------
Started by an SCM change
[EnvInject] - Loading node environment variables.
Building remotely on lp-quantal-server-amd64
$ bzr revision-info -d <http://10.189.74.2:8080/job/jujugui-test-charm/ws/>
info result: bzr revision-info -d <http://10.189.74.2:8080/job/jujugui-test-charm/ws/> returned 0. Command output: "583 matthew.scott at canonical.com-20130419143149-cgnnvf82xdeygvhb
" stderr: ""
[jujugui-test-charm] $ bzr pull --overwrite lp:juju-gui
You have not informed bzr of your Launchpad ID, and you must do this to
write to Launchpad or access private data.  See "bzr help launchpad-login".
http://bazaar.launchpad.net/~juju-gui/juju-gui/trunk is permanently redirected to http://bazaar.launchpad.net/~juju-gui/juju-gui/trunk/changes
You have not informed bzr of your Launchpad ID, and you must do this to
write to Launchpad or access private data.  See "bzr help launchpad-login".
 M  app/app.js
 M  app/models/handlers.js
 M  app/store/endpoints.js
 M  app/store/env/go.js
 M  test/test_endpoints.js
 M  test/test_env_go.js
 M  test/test_model_handlers.js
All changes applied successfully.
Now on revision 584.
[jujugui-test-charm] $ bzr revert
$ bzr revision-info -d <http://10.189.74.2:8080/job/jujugui-test-charm/ws/>
info result: bzr revision-info -d <http://10.189.74.2:8080/job/jujugui-test-charm/ws/> returned 0. Command output: "584 bac at canonical.com-20130419143958-vxi6dry1fuxv33km
" stderr: ""
[jujugui-test-charm] $ bzr log -v -r revid:matthew.scott at canonical.com-20130419143149-cgnnvf82xdeygvhb..revid:bac at canonical.com-20130419143958-vxi6dry1fuxv33km --long --show-ids
Getting local revision...
$ bzr revision-info -d <http://10.189.74.2:8080/job/jujugui-test-charm/ws/>
info result: bzr revision-info -d <http://10.189.74.2:8080/job/jujugui-test-charm/ws/> returned 0. Command output: "584 bac at canonical.com-20130419143958-vxi6dry1fuxv33km
" stderr: ""
RevisionState revno:584 revid:bac at canonical.com-20130419143958-vxi6dry1fuxv33km
[EnvInject] - Injecting environment variables from a build step.
[EnvInject] - Injecting as environment variables the properties content 
JUJU_INSTANCE_IP=91.189.93.93
JUJU_BRANCH=lp:juju-gui
JUJU_CHARM=cs:~juju-gui/precise/juju-gui
FAIL_FAST=1
JUJU_GUI_TEST_BROWSERS=ie chrome firefox

[EnvInject] - Variables injected successfully.
[jujugui-test-charm] $ /bin/sh -xe /tmp/hudson2428186032856502632.sh
+ set -ex
+ cat
+ chmod +x /tmp/test-runner
+ sudo -E su -p -c /tmp/test-runner - jujugui-merger
Clean and Prep
2013-04-19 14:58:03,714 INFO Destroying environment 'juju-gui-testing' (type: openstack)...
2013-04-19 14:58:06,539 INFO 'destroy_environment' command finished successfully
WARNING: this command will destroy the 'juju-gui-testing' environment (type: openstack).
This includes all machines, services, data, and other resources. Continue [y/N] 
Waiting for instances to terminate
Waiting for instances to terminate
Waiting for instances to terminate
This is taking too long. Now trying euca-terminate-instances.

+ euca-terminate-instances i-00007a3d
INSTANCE	i-00007a3d
+ set +x

Waiting for instances to terminate
Lightweight Checkout of lp:juju-gui
You have not informed bzr of your Launchpad ID, and you must do this to
write to Launchpad or access private data.  See "bzr help launchpad-login".
JUJU_INSTANCE_IP=91.189.93.93
Running Tests
ADDRESS	91.189.93.93	i-00007a40
Bootstrapping...
Deploying service...
Setting origin for charm to deploy lp:juju-gui
Waiting for service to start...
Assigning JUJU_INSTANCE_IP 91.189.93.93
Storing Internal IP as 10.55.60.41
Assigned IP to i-00007a40
Exposing the service...
2013-04-19 15:09:33,820 INFO Connecting to environment...
2013-04-19 15:09:38,426 INFO Connected to environment.
2013-04-19 15:09:40,534 INFO 'status' command finished successfully
APP_URL= http://91.189.93.93
Launching ie tests.
test_environment_connection (__main__.TestBasics) ... ok
test_environment_name (__main__.TestBasics) ... ok
test_gui_unit_tests (__main__.TestBasics) ... ok
test_title (__main__.TestBasics) ... ok
test_charm_deploy (__main__.TestDeploy) ... ok
test_staging_services (__main__.TestDeploy) ... ok

----------------------------------------------------------------------
Ran 6 tests in 174.737s

OK
Browser: ie
Test run details at https://saucelabs.com/jobs/2e8bb174936a4aedb6fcb4613a328dd0
restart_api with ip:10.55.60.41
Launching chrome tests.
test_environment_connection (__main__.TestBasics) ... ok
test_environment_name (__main__.TestBasics) ... ok
test_gui_unit_tests (__main__.TestBasics) ... ok
test_title (__main__.TestBasics) ... ok
test_charm_deploy (__main__.TestDeploy) ... ok
test_staging_services (__main__.TestDeploy) ... ok

----------------------------------------------------------------------
Ran 6 tests in 116.454s

OK
Browser: chrome
Test run details at https://saucelabs.com/jobs/0b66c4877a7f4bc2a46eaa9a5f0352f7
restart_api with ip:10.55.60.41
Launching firefox tests.
test_environment_connection (__main__.TestBasics) ... ok
test_environment_name (__main__.TestBasics) ... ok
test_gui_unit_tests (__main__.TestBasics) ... FAIL
test_title (__main__.TestBasics) ... ok
test_charm_deploy (__main__.TestDeploy) ... ok
test_staging_services (__main__.TestDeploy) ... ok

======================================================================
FAIL: test_gui_unit_tests (__main__.TestBasics)
----------------------------------------------------------------------
Traceback (most recent call last):
  File "test/test_charm_running.py", line 72, in test_gui_unit_tests
    self.fail(msg)
AssertionError: 2 failure(s) running 86 tests.

----------------------------------------------------------------------
Ran 6 tests in 151.602s

FAILED (failures=1)
Browser: firefox
Test run details at https://saucelabs.com/jobs/68e68fed2a2b450799d31a45e9754380
2 failure(s) running 89 tests.  Retrying.
2 failure(s) running 82 tests.  Retrying.
2 failure(s) running 82 tests.  Retrying.
2 failure(s) running 79 tests.  Retrying.
restart_api with ip:10.55.60.41
Collected exit code 1
Final instance state
i-00007a3f running i-00007a40 running
+ cat /home/jujugui-merger/exit-status
+ ec=1
+ [ 0 -eq 1 ]
+ wc -l
+ cat /home/jujugui-merger/instance-state
+ [ 2 -lt 2 ]
+ wc -l
+ grep error\|stopped
+ cat /home/jujugui-merger/instance-state
+ [ 0 -gt 0 ]
+ exit 1
Build step 'Execute shell' marked build as failure



More information about the Juju-GUI mailing list