Build failed in Jenkins: jujugui-test-charm #328

Jenkins Notification devnull at canonical.com
Fri Apr 19 14:17:16 UTC 2013


See <http://10.189.74.2:8080/job/jujugui-test-charm/328/changes>

Changes:

[Matthew Scott] Event docs for topology modules.

Expanded event documentation for both events fired and events received.  Added markdown and tested with yuidoc (it's pretty).  QA should be mostly for accuracy, spelling, and grammar.

R=teknico, jeff.pihach
CC=
https://codereview.appspot.com/8661049

------------------------------------------
Started by an SCM change
[EnvInject] - Loading node environment variables.
Building remotely on lp-quantal-server-amd64
$ bzr revision-info -d <http://10.189.74.2:8080/job/jujugui-test-charm/ws/>
info result: bzr revision-info -d <http://10.189.74.2:8080/job/jujugui-test-charm/ws/> returned 0. Command output: "579 francesco.banconi at canonical.com-20130419130029-214abket3oa78d5q
" stderr: ""
[jujugui-test-charm] $ bzr pull --overwrite lp:juju-gui
You have not informed bzr of your Launchpad ID, and you must do this to
write to Launchpad or access private data.  See "bzr help launchpad-login".
http://bazaar.launchpad.net/~juju-gui/juju-gui/trunk is permanently redirected to http://bazaar.launchpad.net/~juju-gui/juju-gui/trunk/changes
You have not informed bzr of your Launchpad ID, and you must do this to
write to Launchpad or access private data.  See "bzr help launchpad-login".
 M  app/views/topology/panzoom.js
 M  app/views/topology/relation.js
 M  app/views/topology/service.js
 M  app/views/topology/topology.js
 M  app/views/topology/viewport.js
All changes applied successfully.
Now on revision 580.
[jujugui-test-charm] $ bzr revert
$ bzr revision-info -d <http://10.189.74.2:8080/job/jujugui-test-charm/ws/>
info result: bzr revision-info -d <http://10.189.74.2:8080/job/jujugui-test-charm/ws/> returned 0. Command output: "580 matthew.scott at canonical.com-20130419135511-twzvaqnuzhf3zd9e
" stderr: ""
[jujugui-test-charm] $ bzr log -v -r revid:francesco.banconi at canonical.com-20130419130029-214abket3oa78d5q..revid:matthew.scott at canonical.com-20130419135511-twzvaqnuzhf3zd9e --long --show-ids
Getting local revision...
$ bzr revision-info -d <http://10.189.74.2:8080/job/jujugui-test-charm/ws/>
info result: bzr revision-info -d <http://10.189.74.2:8080/job/jujugui-test-charm/ws/> returned 0. Command output: "580 matthew.scott at canonical.com-20130419135511-twzvaqnuzhf3zd9e
" stderr: ""
RevisionState revno:580 revid:matthew.scott at canonical.com-20130419135511-twzvaqnuzhf3zd9e
[EnvInject] - Injecting environment variables from a build step.
[EnvInject] - Injecting as environment variables the properties content 
JUJU_INSTANCE_IP=91.189.93.93
JUJU_BRANCH=lp:juju-gui
JUJU_CHARM=cs:~juju-gui/precise/juju-gui
FAIL_FAST=1
JUJU_GUI_TEST_BROWSERS=ie chrome firefox

[EnvInject] - Variables injected successfully.
[jujugui-test-charm] $ /bin/sh -xe /tmp/hudson4500872597391453029.sh
+ set -ex
+ cat
+ chmod +x /tmp/test-runner
+ sudo -E su -p -c /tmp/test-runner - jujugui-merger
Clean and Prep
2013-04-19 13:56:19,167 INFO Destroying environment 'juju-gui-testing' (type: openstack)...
2013-04-19 13:56:22,090 INFO 'destroy_environment' command finished successfully
WARNING: this command will destroy the 'juju-gui-testing' environment (type: openstack).
This includes all machines, services, data, and other resources. Continue [y/N] 
Waiting for instances to terminate
Waiting for instances to terminate
Waiting for instances to terminate
This is taking too long. Now trying euca-terminate-instances.

+ euca-terminate-instances i-00007a38
INSTANCE	i-00007a38
+ set +x

Waiting for instances to terminate
Waiting for instances to terminate
Waiting for instances to terminate
Lightweight Checkout of lp:juju-gui
You have not informed bzr of your Launchpad ID, and you must do this to
write to Launchpad or access private data.  See "bzr help launchpad-login".
JUJU_INSTANCE_IP=91.189.93.93
Running Tests
ADDRESS	91.189.93.93	i-00007a3a
Bootstrapping...
Deploying service...
Setting origin for charm to deploy lp:juju-gui
Waiting for service to start...
Assigning JUJU_INSTANCE_IP 91.189.93.93
Storing Internal IP as 10.55.60.41
Assigned IP to i-00007a3a
Exposing the service...
2013-04-19 14:09:57,537 INFO Connecting to environment...
2013-04-19 14:10:00,275 INFO Connected to environment.
2013-04-19 14:10:02,319 INFO 'status' command finished successfully
APP_URL= http://91.189.93.93
Launching ie tests.
test_environment_connection (__main__.TestBasics) ... ok
test_environment_name (__main__.TestBasics) ... ok
test_gui_unit_tests (__main__.TestBasics) ... ok
test_title (__main__.TestBasics) ... ok
test_charm_deploy (__main__.TestDeploy) ... ok
test_staging_services (__main__.TestDeploy) ... ok

----------------------------------------------------------------------
Ran 6 tests in 163.212s

OK
Browser: ie
Test run details at https://saucelabs.com/jobs/9208a4aeb74d45698026757b134697a4
restart_api with ip:10.55.60.41
Launching chrome tests.
test_environment_connection (__main__.TestBasics) ... ok
test_environment_name (__main__.TestBasics) ... ok
test_gui_unit_tests (__main__.TestBasics) ... ok
test_title (__main__.TestBasics) ... ok
test_charm_deploy (__main__.TestDeploy) ... ok
test_staging_services (__main__.TestDeploy) ... ok

----------------------------------------------------------------------
Ran 6 tests in 116.566s

OK
Browser: chrome
Test run details at https://saucelabs.com/jobs/867d60077544491895cfd1b365b3eb99
restart_api with ip:10.55.60.41
Launching firefox tests.
test_environment_connection (__main__.TestBasics) ... ok
test_environment_name (__main__.TestBasics) ... ok
test_gui_unit_tests (__main__.TestBasics) ... FAIL
test_title (__main__.TestBasics) ... ok
test_charm_deploy (__main__.TestDeploy) ... ok
test_staging_services (__main__.TestDeploy) ... ok

======================================================================
FAIL: test_gui_unit_tests (__main__.TestBasics)
----------------------------------------------------------------------
Traceback (most recent call last):
  File "test/test_charm_running.py", line 72, in test_gui_unit_tests
    self.fail(msg)
AssertionError: 2 failure(s) running 82 tests.

----------------------------------------------------------------------
Ran 6 tests in 151.370s

FAILED (failures=1)
Browser: firefox
Test run details at https://saucelabs.com/jobs/61b6e05ac6e84ea5bd5b30e3c01cf587
2 failure(s) running 80 tests.  Retrying.
2 failure(s) running 82 tests.  Retrying.
2 failure(s) running 82 tests.  Retrying.
2 failure(s) running 78 tests.  Retrying.
restart_api with ip:10.55.60.41
Collected exit code 1
Final instance state
i-00007a39 running i-00007a3a running
+ cat /home/jujugui-merger/exit-status
+ ec=1
+ [ 0 -eq 1 ]
+ wc -l
+ cat /home/jujugui-merger/instance-state
+ [ 2 -lt 2 ]
+ wc -l
+ grep error\|stopped
+ cat /home/jujugui-merger/instance-state
+ [ 0 -gt 0 ]
+ exit 1
Build step 'Execute shell' marked build as failure



More information about the Juju-GUI mailing list