[Bug 2054300] [NEW] package libc6 2.35-0ubuntu3.1 failed to install/upgrade: new libc6:amd64 package pre-installation script subprocess returned error exit status 2

Anuj Kumar 2054300 at bugs.launchpad.net
Mon Feb 19 10:38:40 UTC 2024


Public bug reported:

Gt730

ProblemType: Package
DistroRelease: Ubuntu 22.04
Package: libc6 2.35-0ubuntu3.1
ProcVersionSignature: Ubuntu 5.19.0-32.33~22.04.1-generic 5.19.17
Uname: Linux 5.19.0-32-generic x86_64
NonfreeKernelModules: zfs zunicode zavl icp zcommon znvpair
ApportVersion: 2.20.11-0ubuntu82.3
Architecture: amd64
CasperMD5CheckResult: pass
CasperVersion: 1.470.2
Date: Mon Feb 19 10:20:20 2024
DpkgTerminalLog:
 Preparing to unpack .../libc6_2.35-0ubuntu3.6_amd64.deb ...
 /var/lib/dpkg/tmp.ci/preinst: 44: 3: Bad file descriptor
 dpkg: error processing archive /var/cache/apt/archives/libc6_2.35-0ubuntu3.6_amd64.deb (--unpack):
  new libc6:amd64 package pre-installation script subprocess returned error exit status 2
DuplicateSignature:
 package:libc6:2.35-0ubuntu3.1
 Preparing to unpack .../libc6_2.35-0ubuntu3.6_amd64.deb ...
 /var/lib/dpkg/tmp.ci/preinst: 44: 3: Bad file descriptor
 dpkg: error processing archive /var/cache/apt/archives/libc6_2.35-0ubuntu3.6_amd64.deb (--unpack):
  new libc6:amd64 package pre-installation script subprocess returned error exit status 2
ErrorMessage: new libc6:amd64 package pre-installation script subprocess returned error exit status 2
LiveMediaBuild: Ubuntu 22.04.2 LTS "Jammy Jellyfish" - Release amd64 (20230223)
Python3Details: /usr/bin/python3.10, Python 3.10.6, python3-minimal, 3.10.6-1~22.04
PythonDetails: N/A
RelatedPackageVersions:
 dpkg 1.21.1ubuntu2.1
 apt  2.4.8
SourcePackage: glibc
Title: package libc6 2.35-0ubuntu3.1 failed to install/upgrade: new libc6:amd64 package pre-installation script subprocess returned error exit status 2
UpgradeStatus: No upgrade log present (probably fresh install)

** Affects: glibc (Ubuntu)
     Importance: Undecided
         Status: New


** Tags: amd64 apport-package jammy

-- 
You received this bug notification because you are a member of Ubuntu
Foundations Bugs, which is subscribed to glibc in Ubuntu.
https://bugs.launchpad.net/bugs/2054300

Title:
  package libc6 2.35-0ubuntu3.1 failed to install/upgrade: new
  libc6:amd64 package pre-installation script subprocess returned error
  exit status 2

Status in glibc package in Ubuntu:
  New

Bug description:
  Gt730

  ProblemType: Package
  DistroRelease: Ubuntu 22.04
  Package: libc6 2.35-0ubuntu3.1
  ProcVersionSignature: Ubuntu 5.19.0-32.33~22.04.1-generic 5.19.17
  Uname: Linux 5.19.0-32-generic x86_64
  NonfreeKernelModules: zfs zunicode zavl icp zcommon znvpair
  ApportVersion: 2.20.11-0ubuntu82.3
  Architecture: amd64
  CasperMD5CheckResult: pass
  CasperVersion: 1.470.2
  Date: Mon Feb 19 10:20:20 2024
  DpkgTerminalLog:
   Preparing to unpack .../libc6_2.35-0ubuntu3.6_amd64.deb ...
   /var/lib/dpkg/tmp.ci/preinst: 44: 3: Bad file descriptor
   dpkg: error processing archive /var/cache/apt/archives/libc6_2.35-0ubuntu3.6_amd64.deb (--unpack):
    new libc6:amd64 package pre-installation script subprocess returned error exit status 2
  DuplicateSignature:
   package:libc6:2.35-0ubuntu3.1
   Preparing to unpack .../libc6_2.35-0ubuntu3.6_amd64.deb ...
   /var/lib/dpkg/tmp.ci/preinst: 44: 3: Bad file descriptor
   dpkg: error processing archive /var/cache/apt/archives/libc6_2.35-0ubuntu3.6_amd64.deb (--unpack):
    new libc6:amd64 package pre-installation script subprocess returned error exit status 2
  ErrorMessage: new libc6:amd64 package pre-installation script subprocess returned error exit status 2
  LiveMediaBuild: Ubuntu 22.04.2 LTS "Jammy Jellyfish" - Release amd64 (20230223)
  Python3Details: /usr/bin/python3.10, Python 3.10.6, python3-minimal, 3.10.6-1~22.04
  PythonDetails: N/A
  RelatedPackageVersions:
   dpkg 1.21.1ubuntu2.1
   apt  2.4.8
  SourcePackage: glibc
  Title: package libc6 2.35-0ubuntu3.1 failed to install/upgrade: new libc6:amd64 package pre-installation script subprocess returned error exit status 2
  UpgradeStatus: No upgrade log present (probably fresh install)

To manage notifications about this bug go to:
https://bugs.launchpad.net/ubuntu/+source/glibc/+bug/2054300/+subscriptions




More information about the foundations-bugs mailing list