[Bug 2052525] Re: dracut initramfs missing systemd-executor

Benjamin Drung 2052525 at bugs.launchpad.net
Thu Feb 8 21:29:16 UTC 2024


dracut 060+5-1ubuntu1 fixes the /usr/lib/systemd/systemd-executor
failure, but still seems to fail with the new systemd version.

-- 
You received this bug notification because you are a member of Ubuntu
Foundations Bugs, which is subscribed to dracut in Ubuntu.
Matching subscriptions: dracut
https://bugs.launchpad.net/bugs/2052525

Title:
  dracut initramfs missing systemd-executor

Status in dracut package in Ubuntu:
  In Progress
Status in systemd package in Ubuntu:
  New

Bug description:
  The dracut autopkgtest fails when run against systemd v255.2-3ubuntu2.
  This looks to be the problem:

  
  504s Failed to stat /etc/localtime, ignoring: No such file or directory

  504s /etc/localtime doesn't exist yet, watching /etc
  instead.

  504s Failed to open executor binary
  '/usr/lib/systemd/systemd-executor': No such file or directory

  504s Failed to allocate manager object: No such file or
  directory

  504s [!!!!!!] Failed to allocate manager object.

  504s Rebooting in 10s...

  514s Rebooting now...

  514s [   12.571123] ACPI: PM: Preparing to enter system sleep state S5
  514s [   12.573098] reboot: Restarting system
  514s [   12.574688] reboot: machine restart
  515s TEST: root filesystem on a ext3 filesystem   [FAILED] 
  515s see /tmp/autopkgtest.Vd8poK/autopkgtest_tmp/dracut-test.Fz28KvLkEv/TEST-01-BASIC/test.log
  515s make[1]: Leaving directory '/tmp/autopkgtest.Vd8poK/autopkgtest_tmp/dracut-test.Fz28KvLkEv/TEST-01-BASIC'
  515s make[1]: *** [../Makefile.testdir:4: all] Error 1
  515s make: *** [Makefile:4: TEST-01-BASIC] Error 2
  515s make: Leaving directory '/tmp/autopkgtest.Vd8poK/autopkgtest_tmp/dracut-test.Fz28KvLkEv'
  515s autopkgtest [03:42:52]: test upstream-dracut-core: -----------------------]

  I.e., the systemd-executor binary (which is new in systemd v255) is
  not copied into the initramfs. This has already been fixed in upstream
  dracut.

  [1] https://objectstorage.prodstack5.canonical.com/swift/v1/AUTH_0f9aae918d5b4744bf7b827671c86842/autopkgtest-noble/noble/amd64/d/dracut/20240203_093708_6cc09@/log.gz
  [2] https://github.com/dracutdevs/dracut/commit/bee1c4824a8cd47ce6c01892a548bdc07b1fa678

To manage notifications about this bug go to:
https://bugs.launchpad.net/ubuntu/+source/dracut/+bug/2052525/+subscriptions




More information about the foundations-bugs mailing list