[Bug 2051990] Re: python3-defaults 3.12 causes aubio to fail to build from source
Bug Watch Updater
2051990 at bugs.launchpad.net
Fri Feb 2 07:36:45 UTC 2024
** Changed in: aubio (Debian)
Status: Unknown => New
--
You received this bug notification because you are a member of Ubuntu
Foundations Bugs, which is subscribed to python3-defaults in Ubuntu.
https://bugs.launchpad.net/bugs/2051990
Title:
python3-defaults 3.12 causes aubio to fail to build from source
Status in aubio package in Ubuntu:
New
Status in python3-defaults package in Ubuntu:
New
Status in aubio package in Debian:
New
Bug description:
python3 ./waf configure --verbose --destdir=debian/tmp --prefix=/usr --enable-fftw3f --libdir=/usr/lib/x86_64-linux-gnu
/<<PKGBUILDDIR>>/waflib/Utils.py:443: SyntaxWarning: invalid escape sequence '\d'
return re.split('\d+$',s)[0]
/<<PKGBUILDDIR>>/waflib/ConfigSet.py:7: SyntaxWarning: invalid escape sequence '\ '
re_imp=re.compile('^(#)*?([^#=]*?)\ =\ (.*?)$',re.M)
/<<PKGBUILDDIR>>/waflib/ansiterm.py:178: SyntaxWarning: invalid escape sequence '\['
ansi_tokens=re.compile('(?:\x1b\[([0-9?;]*)([a-zA-Z])|([^\x1b]+))')
Traceback (most recent call last):
File "/<<PKGBUILDDIR>>/./waf", line 164, in <module>
from waflib import Scripting
File "/<<PKGBUILDDIR>>/waflib/Scripting.py", line 7, in <module>
from waflib import Utils,Configure,Logs,Options,ConfigSet,Context,Errors,Build,Node
File "/<<PKGBUILDDIR>>/waflib/Configure.py", line 6, in <module>
from waflib import ConfigSet,Utils,Options,Logs,Context,Build,Errors
File "/<<PKGBUILDDIR>>/waflib/Options.py", line 6, in <module>
from waflib import Logs,Utils,Context,Errors
File "/<<PKGBUILDDIR>>/waflib/Context.py", line 5, in <module>
import os,re,imp,sys
ModuleNotFoundError: No module named 'imp'
make[1]: *** [debian/rules:45: override_dh_auto_configure] Error 1
make[1]: Leaving directory '/<<PKGBUILDDIR>>'
make: *** [debian/rules:22: binary] Error 2
dpkg-buildpackage: error: debian/rules binary subprocess returned exit status 2
--------------------------------------------------------------------------------
Build finished at 2024-02-01T21:23:22Z
To manage notifications about this bug go to:
https://bugs.launchpad.net/ubuntu/+source/aubio/+bug/2051990/+subscriptions
More information about the foundations-bugs
mailing list