[Bug 2032167] Re: internal compiler error: __MATHDECL
Launchpad Bug Tracker
2032167 at bugs.launchpad.net
Mon Oct 23 04:17:22 UTC 2023
[Expired for gcc-11 (Ubuntu) because there has been no activity for 60
days.]
** Changed in: gcc-11 (Ubuntu)
Status: Incomplete => Expired
--
You received this bug notification because you are a member of Ubuntu
Foundations Bugs, which is subscribed to gcc-11 in Ubuntu.
https://bugs.launchpad.net/bugs/2032167
Title:
internal compiler error: __MATHDECL
Status in gcc-11 package in Ubuntu:
Expired
Bug description:
make[3]: Leaving directory '/usr/src/googletest/googletest/monero/build/Linux/release-v0.18/release'
make[3]: Entering directory '/usr/src/googletest/googletest/monero/build/Linux/release-v0.18/release'
[ 48%] Linking CXX static library libmultisig.a
make[3]: Leaving directory '/usr/src/googletest/googletest/monero/build/Linux/release-v0.18/release'
[ 48%] Built target multisig
make[3]: Entering directory '/usr/src/googletest/googletest/monero/build/Linux/release-v0.18/release'
make[3]: Leaving directory '/usr/src/googletest/googletest/monero/build/Linux/release-v0.18/release'
make[3]: Entering directory '/usr/src/googletest/googletest/monero/build/Linux/release-v0.18/release'
[ 48%] Building CXX object src/net/CMakeFiles/obj_net.dir/dandelionpp.cpp.o
[ 48%] Building CXX object src/net/CMakeFiles/obj_net.dir/error.cpp.o
[ 48%] Building CXX object src/net/CMakeFiles/obj_net.dir/http.cpp.o
[ 50%] Building CXX object src/net/CMakeFiles/obj_net.dir/i2p_address.cpp.o
[ 50%] Building CXX object src/net/CMakeFiles/obj_net.dir/parse.cpp.o
[ 50%] Building CXX object src/net/CMakeFiles/obj_net.dir/resolve.cpp.o
[ 50%] Building CXX object src/net/CMakeFiles/obj_net.dir/socks.cpp.o
[ 50%] Building CXX object src/net/CMakeFiles/obj_net.dir/socks_connect.cpp.o
[ 50%] Building CXX object src/net/CMakeFiles/obj_net.dir/tor_address.cpp.o
[ 51%] Building CXX object src/net/CMakeFiles/obj_net.dir/zmq.cpp.o
make[3]: Leaving directory '/usr/src/googletest/googletest/monero/build/Linux/release-v0.18/release'
[ 51%] Built target obj_net
make[3]: Entering directory '/usr/src/googletest/googletest/monero/build/Linux/release-v0.18/release'
make[3]: Leaving directory '/usr/src/googletest/googletest/monero/build/Linux/release-v0.18/release'
make[3]: Entering directory '/usr/src/googletest/googletest/monero/build/Linux/release-v0.18/release'
[ 52%] Linking CXX static library libnet.a
make[3]: Leaving directory '/usr/src/googletest/googletest/monero/build/Linux/release-v0.18/release'
[ 52%] Built target net
make[3]: Entering directory '/usr/src/googletest/googletest/monero/build/Linux/release-v0.18/release'
make[3]: Leaving directory '/usr/src/googletest/googletest/monero/build/Linux/release-v0.18/release'
make[3]: Entering directory '/usr/src/googletest/googletest/monero/build/Linux/release-v0.18/release'
[ 52%] Building CXX object src/mnemonics/CMakeFiles/obj_mnemonics.dir/electrum-words.cpp.o
make[3]: Leaving directory '/usr/src/googletest/googletest/monero/build/Linux/release-v0.18/release'
[ 52%] Built target obj_mnemonics
make[3]: Entering directory '/usr/src/googletest/googletest/monero/build/Linux/release-v0.18/release'
make[3]: Leaving directory '/usr/src/googletest/googletest/monero/build/Linux/release-v0.18/release'
make[3]: Entering directory '/usr/src/googletest/googletest/monero/build/Linux/release-v0.18/release'
[ 52%] Linking CXX static library libmnemonics.a
make[3]: Leaving directory '/usr/src/googletest/googletest/monero/build/Linux/release-v0.18/release'
[ 52%] Built target mnemonics
make[3]: Entering directory '/usr/src/googletest/googletest/monero/build/Linux/release-v0.18/release'
make[3]: Leaving directory '/usr/src/googletest/googletest/monero/build/Linux/release-v0.18/release'
make[3]: Entering directory '/usr/src/googletest/googletest/monero/build/Linux/release-v0.18/release'
[ 52%] Building CXX object src/rpc/CMakeFiles/obj_rpc_base.dir/rpc_args.cpp.o
[ 52%] Building CXX object src/rpc/CMakeFiles/obj_rpc_base.dir/rpc_payment_signature.cpp.o
In file included from /usr/include/c++/11/cmath:45,
from /usr/include/boost/config/no_tr1/cmath.hpp:21,
from /usr/include/boost/date_time/posix_time/posix_time_config.hpp:15,
from /usr/include/boost/date_time/posix_time/posix_time_system.hpp:13,
from /usr/include/boost/date_time/posix_time/ptime.hpp:12,
from /usr/include/boost/date_time/posix_time/posix_time_types.hpp:12,
from /usr/include/boost/thread/thread_time.hpp:11,
from /usr/include/boost/thread/lock_types.hpp:18,
from /usr/include/boost/thread/pthread/mutex.hpp:16,
from /usr/include/boost/thread/mutex.hpp:16,
from /usr/src/googletest/googletest/monero/contrib/epee/include/mlocker.h:33,
from /usr/src/googletest/googletest/monero/contrib/epee/include/string_tools.h:31,
from /usr/src/googletest/googletest/monero/src/rpc/rpc_payment_signature.cpp:33:
/usr/include/x86_64-linux-gnu/bits/mathcalls.h:360:1: internal compiler error: Segmentation fault
360 | __MATHDECL (__intmax_t, fromfpx,, (_Mdouble_ __x, int __round,
| ^~~~~~~~~~
0x7f678d84251f ???
./signal/../sysdeps/unix/sysv/linux/x86_64/libc_sigaction.c:0
0x7f678d829d8f __libc_start_call_main
../sysdeps/nptl/libc_start_call_main.h:58
0x7f678d829e3f __libc_start_main_impl
../csu/libc-start.c:392
Please submit a full bug report,
with preprocessed source if appropriate.
Please include the complete backtrace with any bug report.
See <file:///usr/share/doc/gcc-11/README.Bugs> for instructions.
make[3]: *** [src/rpc/CMakeFiles/obj_rpc_base.dir/build.make:90: src/rpc/CMakeFiles/obj_rpc_base.dir/rpc_payment_signature.cpp.o] Error 1
make[3]: Leaving directory '/usr/src/googletest/googletest/monero/build/Linux/release-v0.18/release'
make[2]: *** [CMakeFiles/Makefile2:2802: src/rpc/CMakeFiles/obj_rpc_base.dir/all] Error 2
make[2]: Leaving directory '/usr/src/googletest/googletest/monero/build/Linux/release-v0.18/release'
make[1]: *** [Makefile:146: all] Error 2
make[1]: Leaving directory '/usr/src/googletest/googletest/monero/build/Linux/release-v0.18/release'
make: *** [Makefile:103: release-all] Error 2
ProblemType: Bug
DistroRelease: Ubuntu 22.04
Package: make 4.3-4.1build1
ProcVersionSignature: Ubuntu 6.2.0-26.26~22.04.1-generic 6.2.13
Uname: Linux 6.2.0-26-generic x86_64
ApportVersion: 2.20.11-0ubuntu82.5
Architecture: amd64
CasperMD5CheckResult: pass
CurrentDesktop: ubuntu:GNOME
Date: Mon Aug 21 00:44:29 2023
InstallationDate: Installed on 2023-08-21 (0 days ago)
InstallationMedia: Ubuntu 22.04.3 LTS "Jammy Jellyfish" - Release amd64 (20230807.2)
ProcEnviron:
PATH=(custom, no user)
XDG_RUNTIME_DIR=<set>
LANG=en_US.UTF-8
SHELL=/bin/bash
SourcePackage: make-dfsg
UpgradeStatus: No upgrade log present (probably fresh install)
To manage notifications about this bug go to:
https://bugs.launchpad.net/ubuntu/+source/gcc-11/+bug/2032167/+subscriptions
More information about the foundations-bugs
mailing list