[Bug 2039451] [NEW] package shim-signed 1.54+15.7-0ubuntu1 failed to install/upgrade: installed shim-signed package post-installation script subprocess returned error exit status 10

Charlie 2039451 at bugs.launchpad.net
Mon Oct 16 13:43:52 UTC 2023


Public bug reported:

sudo apt update
sudo apt upgrage 

return the same error
sudo apt install --fix-broken
Reading package lists... Done
Building dependency tree... 50%
Building dependency tree... Done
Reading state information... Done
0 upgraded, 0 newly installed, 0 to remove and 0 not upgraded.
2 not fully installed or removed.
After this operation, 0 B of additional disk space will be used.
Setting up grub-efi-amd64-signed (1.193.2+2.06-2ubuntu17.2) ...
dpkg: error processing package grub-efi-amd64-signed (--configure):
 installed grub-efi-amd64-signed package post-installation script subprocess ret
urned error exit status 10
No apport report written because the error message indicates its a followup erro
r from a previous failure.
                          dpkg: dependency problems prevent configuration of shi
m-signed:
 shim-signed depends on grub-efi-amd64-signed (>= 1.191~) | grub-efi-arm64-signe
d (>= 1.191~) | base-files (<< 12.3); however:
  Package grub-efi-amd64-signed is not configured yet.
  Package grub-efi-arm64-signed is not installed.
  Version of base-files on system is 12.3ubuntu2.
 shim-signed depends on grub-efi-amd64-signed (>= 1.187.2~) | grub-efi-arm64-sig
ned (>= 1.187.2~); however:
  Package grub-efi-amd64-signed is not configured yet.
  Package grub-efi-arm64-signed is not installed.

dpkg: error processing package shim-signed (--configure):
 dependency problems - leaving unconfigured
Errors were encountered while processing:
 grub-efi-amd64-signed
 shim-signed
E: Sub-process /usr/bin/dpkg returned an error code (1)


none of the Ubuntu fixes work with this issue

ProblemType: Package
DistroRelease: Ubuntu 23.04
Package: shim-signed 1.54+15.7-0ubuntu1
ProcVersionSignature: Ubuntu 6.2.0-34.34-generic 6.2.16
Uname: Linux 6.2.0-34-generic x86_64
.proc.sys.kernel.moksbstate_disabled: Error: [Errno 2] No such file or directory: '/proc/sys/kernel/moksbstate_disabled'
ApportVersion: 2.26.1-0ubuntu2
AptOrdering: NULL: ConfigurePending
Architecture: amd64
CasperMD5CheckResult: pass
Date: Mon Oct 16 14:39:27 2023
DpkgTerminalLog:
 Setting up shim-signed (1.54+15.7-0ubuntu1) ...
 dpkg: error processing package shim-signed (--configure):
  installed shim-signed package post-installation script subprocess returned error exit status 10
ErrorMessage: installed shim-signed package post-installation script subprocess returned error exit status 10
GrubDiff: Binary files /boot/efi/EFI/ubuntu/grubx64.efi and /usr/lib/grub/x86_64-efi-signed/grubx64.efi.signed differ
InstallationDate: Installed on 2023-05-13 (155 days ago)
InstallationMedia: Ubuntu 23.04 "Lunar Lobster" - Release amd64 (20230418)
Python3Details: /usr/bin/python3.11, Python 3.11.4, python3-minimal, 3.11.2-1
PythonDetails: N/A
RelatedPackageVersions:
 dpkg 1.21.21ubuntu1
 apt  2.6.0ubuntu0.1
SecureBoot: 6   0   0   0   1
SourcePackage: shim-signed
Title: package shim-signed 1.54+15.7-0ubuntu1 failed to install/upgrade: installed shim-signed package post-installation script subprocess returned error exit status 10
UpgradeStatus: No upgrade log present (probably fresh install)

** Affects: shim-signed (Ubuntu)
     Importance: Undecided
         Status: New


** Tags: amd64 apport-package lunar

-- 
You received this bug notification because you are a member of Ubuntu
Foundations Bugs, which is subscribed to shim-signed in Ubuntu.
https://bugs.launchpad.net/bugs/2039451

Title:
  package shim-signed 1.54+15.7-0ubuntu1 failed to install/upgrade:
  installed shim-signed package post-installation script subprocess
  returned error exit status 10

Status in shim-signed package in Ubuntu:
  New

Bug description:
  sudo apt update
  sudo apt upgrage 

  return the same error
  sudo apt install --fix-broken
  Reading package lists... Done
  Building dependency tree... 50%
  Building dependency tree... Done
  Reading state information... Done
  0 upgraded, 0 newly installed, 0 to remove and 0 not upgraded.
  2 not fully installed or removed.
  After this operation, 0 B of additional disk space will be used.
  Setting up grub-efi-amd64-signed (1.193.2+2.06-2ubuntu17.2) ...
  dpkg: error processing package grub-efi-amd64-signed (--configure):
   installed grub-efi-amd64-signed package post-installation script subprocess ret
  urned error exit status 10
  No apport report written because the error message indicates its a followup erro
  r from a previous failure.
                            dpkg: dependency problems prevent configuration of shi
  m-signed:
   shim-signed depends on grub-efi-amd64-signed (>= 1.191~) | grub-efi-arm64-signe
  d (>= 1.191~) | base-files (<< 12.3); however:
    Package grub-efi-amd64-signed is not configured yet.
    Package grub-efi-arm64-signed is not installed.
    Version of base-files on system is 12.3ubuntu2.
   shim-signed depends on grub-efi-amd64-signed (>= 1.187.2~) | grub-efi-arm64-sig
  ned (>= 1.187.2~); however:
    Package grub-efi-amd64-signed is not configured yet.
    Package grub-efi-arm64-signed is not installed.

  dpkg: error processing package shim-signed (--configure):
   dependency problems - leaving unconfigured
  Errors were encountered while processing:
   grub-efi-amd64-signed
   shim-signed
  E: Sub-process /usr/bin/dpkg returned an error code (1)

  
  none of the Ubuntu fixes work with this issue

  ProblemType: Package
  DistroRelease: Ubuntu 23.04
  Package: shim-signed 1.54+15.7-0ubuntu1
  ProcVersionSignature: Ubuntu 6.2.0-34.34-generic 6.2.16
  Uname: Linux 6.2.0-34-generic x86_64
  .proc.sys.kernel.moksbstate_disabled: Error: [Errno 2] No such file or directory: '/proc/sys/kernel/moksbstate_disabled'
  ApportVersion: 2.26.1-0ubuntu2
  AptOrdering: NULL: ConfigurePending
  Architecture: amd64
  CasperMD5CheckResult: pass
  Date: Mon Oct 16 14:39:27 2023
  DpkgTerminalLog:
   Setting up shim-signed (1.54+15.7-0ubuntu1) ...
   dpkg: error processing package shim-signed (--configure):
    installed shim-signed package post-installation script subprocess returned error exit status 10
  ErrorMessage: installed shim-signed package post-installation script subprocess returned error exit status 10
  GrubDiff: Binary files /boot/efi/EFI/ubuntu/grubx64.efi and /usr/lib/grub/x86_64-efi-signed/grubx64.efi.signed differ
  InstallationDate: Installed on 2023-05-13 (155 days ago)
  InstallationMedia: Ubuntu 23.04 "Lunar Lobster" - Release amd64 (20230418)
  Python3Details: /usr/bin/python3.11, Python 3.11.4, python3-minimal, 3.11.2-1
  PythonDetails: N/A
  RelatedPackageVersions:
   dpkg 1.21.21ubuntu1
   apt  2.6.0ubuntu0.1
  SecureBoot: 6   0   0   0   1
  SourcePackage: shim-signed
  Title: package shim-signed 1.54+15.7-0ubuntu1 failed to install/upgrade: installed shim-signed package post-installation script subprocess returned error exit status 10
  UpgradeStatus: No upgrade log present (probably fresh install)

To manage notifications about this bug go to:
https://bugs.launchpad.net/ubuntu/+source/shim-signed/+bug/2039451/+subscriptions




More information about the foundations-bugs mailing list