[Bug 2024288] [NEW] package grub-pc 2.06-2ubuntu7.2 failed to install/upgrade: installed grub-pc package post-installation script subprocess returned error exit status 10
Ramesh Nagella
2024288 at bugs.launchpad.net
Sat Jun 17 12:58:32 UTC 2023
Public bug reported:
Package libreoffice-core-nogui is not installed.
Package libreoffice-core is not configured yet.
dpkg: error processing package libreoffice-sdbc-firebird (--configure):
dependency problems - leaving unconfigured
dpkg: dependency problems prevent configuration of libreoffice-sdbc-mysql:
libreoffice-sdbc-mysql depends on libreoffice-core-nogui | libreoffice-core; however:
Package libreoffice-core-nogui is not installed.
Package libreoffice-core is not configured yet.
and in installing mysql and github are also getting errors they are are not getting installed on this software
and my system software is
GNU bash, version 5.1.16(1)-release (x86_64-pc-linux-gnu)
ProblemType: Package
DistroRelease: Ubuntu 22.04
Package: grub-pc 2.06-2ubuntu7.2
ProcVersionSignature: Ubuntu 5.19.0-43.44~22.04.1-generic 5.19.17
Uname: Linux 5.19.0-43-generic x86_64
ApportVersion: 2.20.11-0ubuntu82.5
AptOrdering: NULL: ConfigurePending
Architecture: amd64
CasperMD5CheckResult: pass
Date: Sat Jun 17 18:12:43 2023
DpkgTerminalLog:
Setting up grub-pc (2.06-2ubuntu7.2) ...
dpkg: error processing package grub-pc (--configure):
installed grub-pc package post-installation script subprocess returned error exit status 10
DuplicateSignature:
package:grub-pc:2.06-2ubuntu7.2
Setting up grub-pc (2.06-2ubuntu7.2) ...
dpkg: error processing package grub-pc (--configure):
installed grub-pc package post-installation script subprocess returned error exit status 10
ErrorMessage: installed grub-pc package post-installation script subprocess returned error exit status 10
InstallationDate: Installed on 2023-05-30 (18 days ago)
InstallationMedia: Ubuntu 22.04.2 LTS "Jammy Jellyfish" - Release amd64 (20230223)
ProcCmdLine: BOOT_IMAGE=/boot/vmlinuz-5.19.0-43-generic root=UUID=3203c2f8-1d9c-4585-a215-74424f0e8213 ro quiet splash
Python3Details: /usr/bin/python3.10, Python 3.10.6, unpackaged
PythonDetails: N/A
RebootRequiredPkgs: Error: path contained symlinks.
RelatedPackageVersions:
dpkg 1.21.1ubuntu2.2
apt 2.4.9
SourcePackage: grub2
Title: package grub-pc 2.06-2ubuntu7.2 failed to install/upgrade: installed grub-pc package post-installation script subprocess returned error exit status 10
UpgradeStatus: No upgrade log present (probably fresh install)
** Affects: grub2 (Ubuntu)
Importance: Undecided
Status: New
** Tags: amd64 apport-package jammy
--
You received this bug notification because you are a member of Ubuntu
Foundations Bugs, which is subscribed to grub2 in Ubuntu.
https://bugs.launchpad.net/bugs/2024288
Title:
package grub-pc 2.06-2ubuntu7.2 failed to install/upgrade: installed
grub-pc package post-installation script subprocess returned error
exit status 10
Status in grub2 package in Ubuntu:
New
Bug description:
Package libreoffice-core-nogui is not installed.
Package libreoffice-core is not configured yet.
dpkg: error processing package libreoffice-sdbc-firebird (--configure):
dependency problems - leaving unconfigured
dpkg: dependency problems prevent configuration of libreoffice-sdbc-mysql:
libreoffice-sdbc-mysql depends on libreoffice-core-nogui | libreoffice-core; however:
Package libreoffice-core-nogui is not installed.
Package libreoffice-core is not configured yet.
and in installing mysql and github are also getting errors they are are not getting installed on this software
and my system software is
GNU bash, version 5.1.16(1)-release (x86_64-pc-linux-gnu)
ProblemType: Package
DistroRelease: Ubuntu 22.04
Package: grub-pc 2.06-2ubuntu7.2
ProcVersionSignature: Ubuntu 5.19.0-43.44~22.04.1-generic 5.19.17
Uname: Linux 5.19.0-43-generic x86_64
ApportVersion: 2.20.11-0ubuntu82.5
AptOrdering: NULL: ConfigurePending
Architecture: amd64
CasperMD5CheckResult: pass
Date: Sat Jun 17 18:12:43 2023
DpkgTerminalLog:
Setting up grub-pc (2.06-2ubuntu7.2) ...
dpkg: error processing package grub-pc (--configure):
installed grub-pc package post-installation script subprocess returned error exit status 10
DuplicateSignature:
package:grub-pc:2.06-2ubuntu7.2
Setting up grub-pc (2.06-2ubuntu7.2) ...
dpkg: error processing package grub-pc (--configure):
installed grub-pc package post-installation script subprocess returned error exit status 10
ErrorMessage: installed grub-pc package post-installation script subprocess returned error exit status 10
InstallationDate: Installed on 2023-05-30 (18 days ago)
InstallationMedia: Ubuntu 22.04.2 LTS "Jammy Jellyfish" - Release amd64 (20230223)
ProcCmdLine: BOOT_IMAGE=/boot/vmlinuz-5.19.0-43-generic root=UUID=3203c2f8-1d9c-4585-a215-74424f0e8213 ro quiet splash
Python3Details: /usr/bin/python3.10, Python 3.10.6, unpackaged
PythonDetails: N/A
RebootRequiredPkgs: Error: path contained symlinks.
RelatedPackageVersions:
dpkg 1.21.1ubuntu2.2
apt 2.4.9
SourcePackage: grub2
Title: package grub-pc 2.06-2ubuntu7.2 failed to install/upgrade: installed grub-pc package post-installation script subprocess returned error exit status 10
UpgradeStatus: No upgrade log present (probably fresh install)
To manage notifications about this bug go to:
https://bugs.launchpad.net/ubuntu/+source/grub2/+bug/2024288/+subscriptions
More information about the foundations-bugs
mailing list