[Bug 2029892] [NEW] package libpangoft2-1.0-0 1.50.6+ds-2 failed to install/upgrade: dpkg-deb --control subprocess returned error exit status 2
José Augusto
2029892 at bugs.launchpad.net
Fri Aug 4 05:22:55 UTC 2023
Public bug reported:
Didn`t complete the installation
ProblemType: Package
DistroRelease: Ubuntu 22.04
Package: libpangoft2-1.0-0 1.50.6+ds-2ubuntu1
ProcVersionSignature: Ubuntu 6.2.0-26.26~22.04.1-generic 6.2.13
Uname: Linux 6.2.0-26-generic x86_64
ApportVersion: 2.20.11-0ubuntu82.5
Architecture: amd64
CasperMD5CheckResult: unknown
Date: Fri Aug 4 02:17:43 2023
DuplicateSignature:
package:libpangoft2-1.0-0:1.50.6+ds-2
Unpacking libpango-1.0-0:amd64 (1.50.6+ds-2ubuntu1) over (1.50.6+ds-2) ...
dpkg-deb: error: tar subprocess was killed by signal (Segmentation fault), core dumped
dpkg: error processing archive /tmp/apt-dpkg-install-SHYcVK/068-libpangoft2-1.0-0_1.50.6+ds-2ubuntu1_amd64.deb (--unpack):
dpkg-deb --control subprocess returned error exit status 2
ErrorMessage: dpkg-deb --control subprocess returned error exit status 2
InstallationDate: Installed on 2023-08-04 (0 days ago)
InstallationMedia: Ubuntu 22.04.2 LTS "Jammy Jellyfish" - Release amd64 (20230223)
Python3Details: /usr/bin/python3.10, Python 3.10.12, python3-minimal, 3.10.6-1~22.04
PythonDetails: N/A
RebootRequiredPkgs: Error: path contained symlinks.
RelatedPackageVersions:
dpkg 1.21.1ubuntu2.2
apt 2.4.9
SourcePackage: pango1.0
Title: package libpangoft2-1.0-0 1.50.6+ds-2 failed to install/upgrade: dpkg-deb --control subprocess returned error exit status 2
UpgradeStatus: No upgrade log present (probably fresh install)
** Affects: pango1.0 (Ubuntu)
Importance: Undecided
Status: New
** Tags: amd64 apport-package jammy
--
You received this bug notification because you are a member of Ubuntu
Foundations Bugs, which is subscribed to pango1.0 in Ubuntu.
https://bugs.launchpad.net/bugs/2029892
Title:
package libpangoft2-1.0-0 1.50.6+ds-2 failed to install/upgrade: dpkg-
deb --control subprocess returned error exit status 2
Status in pango1.0 package in Ubuntu:
New
Bug description:
Didn`t complete the installation
ProblemType: Package
DistroRelease: Ubuntu 22.04
Package: libpangoft2-1.0-0 1.50.6+ds-2ubuntu1
ProcVersionSignature: Ubuntu 6.2.0-26.26~22.04.1-generic 6.2.13
Uname: Linux 6.2.0-26-generic x86_64
ApportVersion: 2.20.11-0ubuntu82.5
Architecture: amd64
CasperMD5CheckResult: unknown
Date: Fri Aug 4 02:17:43 2023
DuplicateSignature:
package:libpangoft2-1.0-0:1.50.6+ds-2
Unpacking libpango-1.0-0:amd64 (1.50.6+ds-2ubuntu1) over (1.50.6+ds-2) ...
dpkg-deb: error: tar subprocess was killed by signal (Segmentation fault), core dumped
dpkg: error processing archive /tmp/apt-dpkg-install-SHYcVK/068-libpangoft2-1.0-0_1.50.6+ds-2ubuntu1_amd64.deb (--unpack):
dpkg-deb --control subprocess returned error exit status 2
ErrorMessage: dpkg-deb --control subprocess returned error exit status 2
InstallationDate: Installed on 2023-08-04 (0 days ago)
InstallationMedia: Ubuntu 22.04.2 LTS "Jammy Jellyfish" - Release amd64 (20230223)
Python3Details: /usr/bin/python3.10, Python 3.10.12, python3-minimal, 3.10.6-1~22.04
PythonDetails: N/A
RebootRequiredPkgs: Error: path contained symlinks.
RelatedPackageVersions:
dpkg 1.21.1ubuntu2.2
apt 2.4.9
SourcePackage: pango1.0
Title: package libpangoft2-1.0-0 1.50.6+ds-2 failed to install/upgrade: dpkg-deb --control subprocess returned error exit status 2
UpgradeStatus: No upgrade log present (probably fresh install)
To manage notifications about this bug go to:
https://bugs.launchpad.net/ubuntu/+source/pango1.0/+bug/2029892/+subscriptions
More information about the foundations-bugs
mailing list