[Bug 1987001] [NEW] netplan.io autopkgtest failures with NetworkManager 1.39.90
Jeremy Bicha
1987001 at bugs.launchpad.net
Thu Aug 18 21:12:39 UTC 2022
Public bug reported:
netplan.io's autopkgtests are failing with NetworkManager 1.40 RC1
(1.39.90).
https://autopkgtest.ubuntu.com/packages/n/netplan.io/kinetic/amd64
https://gitlab.freedesktop.org/NetworkManager/NetworkManager/-/blob/nm-1-40/NEWS
log excerpt:
======================================================================
FAIL: test_bond_mode_8023ad_adselect (__main__.TestNetworkManager)
----------------------------------------------------------------------
Traceback (most recent call last):
File "/tmp/autopkgtest.iNCkRv/build.oDI/src/tests/integration/bonds.py", line 147, in test_bond_mode_8023ad_adselect
self.assertEqual(f.read().strip(), 'bandwidth 1')
AssertionError: 'stable 0' != 'bandwidth 1'
- stable 0
+ bandwidth 1
======================================================================
FAIL: test_bond_mode_balance_tlb_learn_interval (__main__.TestNetworkManager)
----------------------------------------------------------------------
Traceback (most recent call last):
File "/tmp/autopkgtest.iNCkRv/build.oDI/src/tests/integration/bonds.py", line 670, in test_bond_mode_balance_tlb_learn_interval
self.assertEqual(f.read().strip(), '15')
AssertionError: '1' != '15'
- 1
+ 15
? +
** Affects: netplan.io (Ubuntu)
Importance: High
Status: Confirmed
** Tags: kinetic rls-kk-incoming update-excuse
--
You received this bug notification because you are a member of Ubuntu
Foundations Bugs, which is subscribed to netplan.io in Ubuntu.
Matching subscriptions: foundations-bugs
https://bugs.launchpad.net/bugs/1987001
Title:
netplan.io autopkgtest failures with NetworkManager 1.39.90
Status in netplan.io package in Ubuntu:
Confirmed
Bug description:
netplan.io's autopkgtests are failing with NetworkManager 1.40 RC1
(1.39.90).
https://autopkgtest.ubuntu.com/packages/n/netplan.io/kinetic/amd64
https://gitlab.freedesktop.org/NetworkManager/NetworkManager/-/blob/nm-1-40/NEWS
log excerpt:
======================================================================
FAIL: test_bond_mode_8023ad_adselect (__main__.TestNetworkManager)
----------------------------------------------------------------------
Traceback (most recent call last):
File "/tmp/autopkgtest.iNCkRv/build.oDI/src/tests/integration/bonds.py", line 147, in test_bond_mode_8023ad_adselect
self.assertEqual(f.read().strip(), 'bandwidth 1')
AssertionError: 'stable 0' != 'bandwidth 1'
- stable 0
+ bandwidth 1
======================================================================
FAIL: test_bond_mode_balance_tlb_learn_interval (__main__.TestNetworkManager)
----------------------------------------------------------------------
Traceback (most recent call last):
File "/tmp/autopkgtest.iNCkRv/build.oDI/src/tests/integration/bonds.py", line 670, in test_bond_mode_balance_tlb_learn_interval
self.assertEqual(f.read().strip(), '15')
AssertionError: '1' != '15'
- 1
+ 15
? +
To manage notifications about this bug go to:
https://bugs.launchpad.net/ubuntu/+source/netplan.io/+bug/1987001/+subscriptions
More information about the foundations-bugs
mailing list