[Bug 1891486] Re: vim ftbfs in focal (armhf, ppc64el)
Michael Hudson-Doyle
1891486 at bugs.launchpad.net
Sun Jan 10 22:42:28 UTC 2021
These seem to have both passed on retry...
--
You received this bug notification because you are a member of Ubuntu
Foundations Bugs, which is subscribed to vim in Ubuntu.
https://bugs.launchpad.net/bugs/1891486
Title:
vim ftbfs in focal (armhf, ppc64el)
Status in vim package in Ubuntu:
Confirmed
Status in vim source package in Focal:
New
Bug description:
seen in a focal test rebuild:
https://launchpad.net/ubuntu/+archive/test-rebuild-20200810-focal/+build/19801040
https://launchpad.net/ubuntu/+archive/test-rebuild-20200810-focal/+build/19801038
-------------------------------
Executed: 2257 Tests
Skipped: 31 Tests
FAILED: 1 Tests
Failures:
From test_debugger.vim:
Found errors in Test_Debugger():
function RunTheTest[40]..Test_Debugger[157]..RunDbgCmd[8]..WaitForAssert[2]..<SNR>6_WaitForCommon[11]..<lambda>59 line 1: Expected 'No breakpoints defined' but got 'cmd: echo Foo()'
function RunTheTest[40]..Test_Debugger[185]..RunDbgCmd[8]..WaitForAssert[2]..<SNR>6_WaitForCommon[11]..<lambda>71 line 1: Expected '19' but got '~\[ occurs 74 times]'
function RunTheTest[40]..Test_Debugger[188]..RunDbgCmd[8]..WaitForAssert[2]..<SNR>6_WaitForCommon[11]..<lambda>72 line 1: Expected 'E161: Breakpoint not found: 2' but got '~\[ occurs 74 times]'
function RunTheTest[40]..Test_Debugger[192]..RunDbgCmd[8]..WaitForAssert[2]..<SNR>6_WaitForCommon[11]..<lambda>73 line 1: Expected 'Entering Debug mode. Type "cont" to continue.' but got '~\[ occurs 74 times]'
function RunTheTest[40]..Test_Debugger[192]..RunDbgCmd[8]..WaitForAssert[2]..<SNR>6_WaitForCommon[11]..<lambda>74 line 1: Expected 'function Bazz' but got '~\[ occurs 74 times]'
function RunTheTest[40]..Test_Debugger[192]..RunDbgCmd[8]..WaitForAssert[2]..<SNR>6_WaitForCommon[11]..<lambda>75 line 1: Expected 'line 2: let var1 = 3 + a:var' but got '~\[ occurs 74 times]'
function RunTheTest[40]..Test_Debugger[199]..RunDbgCmd[8]..WaitForAssert[2]..<SNR>6_WaitForCommon[11]..<lambda>76 line 1: Expected ' 3 func Bazz line 2' but got '~\[ occurs 74 times]'
function RunTheTest[40]..Test_Debugger[199]..RunDbgCmd[8]..WaitForAssert[2]..<SNR>6_WaitForCommon[11]..<lambda>77 line 1: Expected ' 4 expr var3' but got '~\[ occurs 74 times]'
function RunTheTest[40]..Test_Debugger[201]..RunDbgCmd[8]..WaitForAssert[2]..<SNR>6_WaitForCommon[11]..<lambda>78 line 1: Expected 'Breakpoint in "Bazz" line 5' but got '~\[ occurs 74 times]'
function RunTheTest[40]..Test_Debugger[201]..RunDbgCmd[8]..WaitForAssert[2]..<SNR>6_WaitForCommon[11]..<lambda>79 line 1: Expected 'Oldval = "''another var''"' but got '~\[ occurs 74 times]'
function RunTheTest[40]..Test_Debugger[201]..RunDbgCmd[8]..WaitForAssert[2]..<SNR>6_WaitForCommon[11]..<lambda>80 line 1: Expected 'Newval = "''value2''"' but got '~\[ occurs 74 times]'
function RunTheTest[40]..Test_Debugger[201]..RunDbgCmd[8]..WaitForAssert[2]..<SNR>6_WaitForCommon[11]..<lambda>81 line 1: Expected 'function Bazz' but got '~\[ occurs 74 times]'
function RunTheTest[40]..Test_Debugger[201]..RunDbgCmd[8]..WaitForAssert[2]..<SNR>6_WaitForCommon[11]..<lambda>82 line 1: Expected 'line 5: catch' but got '~\[ occurs 74 times]'
function RunTheTest[40]..Test_Debugger[208]..RunDbgCmd[8]..WaitForAssert[2]..<SNR>6_WaitForCommon[11]..<lambda>83 line 1: Expected 'No breakpoints defined' but got '~\[ occurs 74 times]'
function RunTheTest[40]..Test_Debugger[211]..RunDbgCmd[8]..WaitForAssert[2]..<SNR>6_WaitForCommon[11]..<lambda>84 line 1: Expected 'Error detected while processing function Bazz:' but got '~\[ occurs 74 times]'
function RunTheTest[40]..Test_Debugger[211]..RunDbgCmd[8]..WaitForAssert[2]..<SNR>6_WaitForCommon[11]..<lambda>85 line 1: Expected 'line 5:' but got '~\[ occurs 74 times]'
function RunTheTest[40]..Test_Debugger[211]..RunDbgCmd[8]..WaitForAssert[2]..<SNR>6_WaitForCommon[11]..<lambda>86 line 1: Expected 'E475: Invalid argument: abcd' but got '~\[ occurs 74 times]'
function RunTheTest[40]..Test_Debugger[215]..RunDbgCmd[8]..WaitForAssert[2]..<SNR>6_WaitForCommon[11]..<lambda>87 line 1: Expected 'E475: Invalid argument: func' but got '~\[ occurs 74 times]'
function RunTheTest[40]..Test_Debugger[216]..RunDbgCmd[8]..WaitForAssert[2]..<SNR>6_WaitForCommon[11]..<lambda>88 line 1: Expected 'E475: Invalid argument: func 2' but got '~\[ occurs 74 times]'
function RunTheTest[40]..Test_Debugger[217]..RunDbgCmd[8]..WaitForAssert[2]..<SNR>6_WaitForCommon[11]..<lambda>89 line 1: Expected 'E475: Invalid argument: func a()' but got '~\[ occurs 74 times]'
function RunTheTest[40]..Test_Debugger[218]..RunDbgCmd[8]..WaitForAssert[2]..<SNR>6_WaitForCommon[11]..<lambda>90 line 1: Expected 'E475: Invalid argument: abcd' but got '~\[ occurs 74 times]'
function RunTheTest[40]..Test_Debugger[219]..RunDbgCmd[8]..WaitForAssert[2]..<SNR>6_WaitForCommon[11]..<lambda>91 line 1: Expected 'E475: Invalid argument: func' but got '~\[ occurs 74 times]'
function RunTheTest[40]..Test_Debugger[220]..RunDbgCmd[8]..WaitForAssert[2]..<SNR>6_WaitForCommon[11]..<lambda>92 line 1: Expected 'E475: Invalid argument: func a()' but got '~\[ occurs 74 times]'
function RunTheTest[40]..Test_Debugger[221]..RunDbgCmd[8]..WaitForAssert[2]..<SNR>6_WaitForCommon[11]..<lambda>93 line 1: Expected 'E161: Breakpoint not found: func a' but got '~\[ occurs 74 times]'
function RunTheTest[40]..Test_Debugger[222]..RunDbgCmd[8]..WaitForAssert[2]..<SNR>6_WaitForCommon[11]..<lambda>94 line 1: Expected 'E475: Invalid argument: expr' but got '~\[ occurs 74 times]'
function RunTheTest[40]..Test_Debugger[223]..RunDbgCmd[8]..WaitForAssert[2]..<SNR>6_WaitForCommon[11]..<lambda>95 line 1: Expected 'E121: Undefined variable: x' but got '~\[ occurs 74 times]'
function RunTheTest[40]..Test_Debugger[223]..RunDbgCmd[8]..WaitForAssert[2]..<SNR>6_WaitForCommon[11]..<lambda>96 line 1: Expected 'E161: Breakpoint not found: expr x' but got '~\[ occurs 74 times]'
function RunTheTest[40]..Test_Debugger[228]..RunDbgCmd[8]..WaitForAssert[2]..<SNR>6_WaitForCommon[11]..<lambda>97 line 1: Expected 'function Bazz' but got '~\[ occurs 74 times]'
function RunTheTest[40]..Test_Debugger[228]..RunDbgCmd[8]..WaitForAssert[2]..<SNR>6_WaitForCommon[11]..<lambda>98 line 1: Expected 'line 8: End of function' but got '~\[ occurs 74 times]'
function RunTheTest[40]..Test_Debugger[237]..RunDbgCmd[8]..WaitForAssert[2]..<SNR>6_WaitForCommon[11]..<lambda>99 line 1: Expected 'function Bar' but got ''
function RunTheTest[40]..Test_Debugger[237]..RunDbgCmd[8]..WaitForAssert[2]..<SNR>6_WaitForCommon[11]..<lambda>100 line 1: Expected 'line 3: return var2' but got ''
function RunTheTest[40]..Test_Debugger[246]..RunDbgCmd[8]..WaitForAssert[2]..<SNR>6_WaitForCommon[11]..<lambda>101 line 1: Expected 'Exception thrown: Vim:Interrupt' but got 'step'
function RunTheTest[40]..Test_Debugger[246]..RunDbgCmd[8]..WaitForAssert[2]..<SNR>6_WaitForCommon[11]..<lambda>102 line 1: Expected 'function Bazz' but got 'interrupt'
function RunTheTest[40]..Test_Debugger[246]..RunDbgCmd[8]..WaitForAssert[2]..<SNR>6_WaitForCommon[11]..<lambda>103 line 1: Expected 'line 5: catch' but got ''
function RunTheTest[40]..Test_Debugger[257]..RunDbgCmd[8]..WaitForAssert[2]..<SNR>6_WaitForCommon[11]..<lambda>104 line 1: Expected 'Breakpoint in "Bazz" line 3' but got 'breakadd func 3 Bazz'
function RunTheTest[40]..Test_Debugger[257]..RunDbgCmd[8]..WaitForAssert[2]..<SNR>6_WaitForCommon[11]..<lambda>105 line 1: Expected 'function Foo[2]..Bar[2]..Bazz' but got 'cont'
function RunTheTest[40]..Test_Debugger[257]..RunDbgCmd[8]..WaitForAssert[2]..<SNR>6_WaitForCommon[11]..<lambda>106 line 1: Expected 'line 3: let var3 = "another var"' but got ''
function RunTheTest[40]..Test_Debugger[261]..RunDbgCmd[8]..WaitForAssert[2]..<SNR>6_WaitForCommon[11]..<lambda>107 line 1: Expected 'Breakpoint in "Foo" line 3' but got 'cont'
function RunTheTest[40]..Test_Debugger[261]..RunDbgCmd[8]..WaitForAssert[2]..<SNR>6_WaitForCommon[11]..<lambda>108 line 1: Expected 'function Foo' but got 'quit'
function RunTheTest[40]..Test_Debugger[261]..RunDbgCmd[8]..WaitForAssert[2]..<SNR>6_WaitForCommon[11]..<lambda>109 line 1: Expected 'line 3: return var2' but got ''
TEST FAILURE
make[2]: *** [Makefile:58: report] Error 1
make[2]: Leaving directory '/<<PKGBUILDDIR>>/src/vim-gtk3/testdir'
make[1]: *** [Makefile:2213: scripttests] Error 2
make[1]: Leaving directory '/<<PKGBUILDDIR>>/src/vim-gtk3'
make: *** [debian/rules:243: build-vim-gtk3-stamp] Error 2
rm configure-vim-basic-stamp configure-vim-tiny-stamp configure-vim-gtk3-stamp
dpkg-buildpackage: error: debian/rules binary-arch subprocess returned exit status 2
To manage notifications about this bug go to:
https://bugs.launchpad.net/ubuntu/+source/vim/+bug/1891486/+subscriptions
More information about the foundations-bugs
mailing list