[Bug 1955085] [NEW] package systemd 245.4-4ubuntu3.13 failed to install/upgrade: installed systemd package post-installation script subprocess returned error exit status 127
Silvano Condrea
1955085 at bugs.launchpad.net
Thu Dec 16 23:23:27 UTC 2021
Public bug reported:
New to Ubuntu/linux, got an error that asked to report. I did. I do not
have any detailed information about this error.
ProblemType: Package
DistroRelease: Ubuntu 20.04
Package: systemd 245.4-4ubuntu3.13
ProcVersionSignature: Ubuntu 5.11.0-41.45~20.04.1-generic 5.11.22
Uname: Linux 5.11.0-41-generic x86_64
ApportVersion: 2.20.11-0ubuntu27.21
Architecture: amd64
CasperMD5CheckResult: skip
Date: Wed Dec 15 03:31:02 2021
DuplicateSignature:
package:systemd:245.4-4ubuntu3.13
Installing new version of config file /etc/dhcp/dhclient-enter-hooks.d/resolved ...
systemd-machine-id-setup: error while loading shared libraries: libpam.so.0: cannot open shared object file: No such file or directory
dpkg: error processing package systemd (--configure):
installed systemd package post-installation script subprocess returned error exit status 127
ErrorMessage: installed systemd package post-installation script subprocess returned error exit status 127
InstallationDate: Installed on 2021-12-15 (1 days ago)
InstallationMedia: Ubuntu 20.04.3 LTS "Focal Fossa" - Release amd64 (20210819)
Lsusb:
Bus 001 Device 002: ID 80ee:0021 VirtualBox USB Tablet
Bus 001 Device 001: ID 1d6b:0001 Linux Foundation 1.1 root hub
Lsusb-t:
/: Bus 01.Port 1: Dev 1, Class=root_hub, Driver=ohci-pci/12p, 12M
|__ Port 1: Dev 2, If 0, Class=Human Interface Device, Driver=usbhid, 12M
MachineType: innotek GmbH VirtualBox
ProcKernelCmdLine: BOOT_IMAGE=/boot/vmlinuz-5.11.0-41-generic root=UUID=5a0eb9db-11d1-4e63-a3c3-c001c342f9fe ro quiet splash
Python3Details: /usr/bin/python3.8, Python 3.8.10, python3-minimal, 3.8.2-0ubuntu2
PythonDetails: N/A
RelatedPackageVersions:
dpkg 1.19.7ubuntu3
apt 2.0.6
SourcePackage: systemd
SystemdDelta:
[EXTENDED] /usr/lib/systemd/system/open-vm-tools.service → /usr/lib/systemd/system/open-vm-tools.service.d/desktop.conf
[EXTENDED] /usr/lib/systemd/system/rc-local.service → /usr/lib/systemd/system/rc-local.service.d/debian.conf
[EXTENDED] /usr/lib/systemd/system/user at .service → /usr/lib/systemd/system/user at .service.d/timeout.conf
3 overridden configuration files found.
Title: package systemd 245.4-4ubuntu3.13 failed to install/upgrade: installed systemd package post-installation script subprocess returned error exit status 127
UpgradeStatus: No upgrade log present (probably fresh install)
dmi.bios.date: 12/01/2006
dmi.bios.vendor: innotek GmbH
dmi.bios.version: VirtualBox
dmi.board.name: VirtualBox
dmi.board.vendor: Oracle Corporation
dmi.board.version: 1.2
dmi.chassis.type: 1
dmi.chassis.vendor: Oracle Corporation
dmi.modalias: dmi:bvninnotekGmbH:bvrVirtualBox:bd12/01/2006:svninnotekGmbH:pnVirtualBox:pvr1.2:sku:rvnOracleCorporation:rnVirtualBox:rvr1.2:cvnOracleCorporation:ct1:cvr:
dmi.product.family: Virtual Machine
dmi.product.name: VirtualBox
dmi.product.version: 1.2
dmi.sys.vendor: innotek GmbH
** Affects: systemd (Ubuntu)
Importance: Undecided
Status: New
** Tags: amd64 apport-package focal need-duplicate-check
--
You received this bug notification because you are a member of Ubuntu
Foundations Bugs, which is subscribed to systemd in Ubuntu.
https://bugs.launchpad.net/bugs/1955085
Title:
package systemd 245.4-4ubuntu3.13 failed to install/upgrade: installed
systemd package post-installation script subprocess returned error
exit status 127
Status in systemd package in Ubuntu:
New
Bug description:
New to Ubuntu/linux, got an error that asked to report. I did. I do
not have any detailed information about this error.
ProblemType: Package
DistroRelease: Ubuntu 20.04
Package: systemd 245.4-4ubuntu3.13
ProcVersionSignature: Ubuntu 5.11.0-41.45~20.04.1-generic 5.11.22
Uname: Linux 5.11.0-41-generic x86_64
ApportVersion: 2.20.11-0ubuntu27.21
Architecture: amd64
CasperMD5CheckResult: skip
Date: Wed Dec 15 03:31:02 2021
DuplicateSignature:
package:systemd:245.4-4ubuntu3.13
Installing new version of config file /etc/dhcp/dhclient-enter-hooks.d/resolved ...
systemd-machine-id-setup: error while loading shared libraries: libpam.so.0: cannot open shared object file: No such file or directory
dpkg: error processing package systemd (--configure):
installed systemd package post-installation script subprocess returned error exit status 127
ErrorMessage: installed systemd package post-installation script subprocess returned error exit status 127
InstallationDate: Installed on 2021-12-15 (1 days ago)
InstallationMedia: Ubuntu 20.04.3 LTS "Focal Fossa" - Release amd64 (20210819)
Lsusb:
Bus 001 Device 002: ID 80ee:0021 VirtualBox USB Tablet
Bus 001 Device 001: ID 1d6b:0001 Linux Foundation 1.1 root hub
Lsusb-t:
/: Bus 01.Port 1: Dev 1, Class=root_hub, Driver=ohci-pci/12p, 12M
|__ Port 1: Dev 2, If 0, Class=Human Interface Device, Driver=usbhid, 12M
MachineType: innotek GmbH VirtualBox
ProcKernelCmdLine: BOOT_IMAGE=/boot/vmlinuz-5.11.0-41-generic root=UUID=5a0eb9db-11d1-4e63-a3c3-c001c342f9fe ro quiet splash
Python3Details: /usr/bin/python3.8, Python 3.8.10, python3-minimal, 3.8.2-0ubuntu2
PythonDetails: N/A
RelatedPackageVersions:
dpkg 1.19.7ubuntu3
apt 2.0.6
SourcePackage: systemd
SystemdDelta:
[EXTENDED] /usr/lib/systemd/system/open-vm-tools.service → /usr/lib/systemd/system/open-vm-tools.service.d/desktop.conf
[EXTENDED] /usr/lib/systemd/system/rc-local.service → /usr/lib/systemd/system/rc-local.service.d/debian.conf
[EXTENDED] /usr/lib/systemd/system/user at .service → /usr/lib/systemd/system/user at .service.d/timeout.conf
3 overridden configuration files found.
Title: package systemd 245.4-4ubuntu3.13 failed to install/upgrade: installed systemd package post-installation script subprocess returned error exit status 127
UpgradeStatus: No upgrade log present (probably fresh install)
dmi.bios.date: 12/01/2006
dmi.bios.vendor: innotek GmbH
dmi.bios.version: VirtualBox
dmi.board.name: VirtualBox
dmi.board.vendor: Oracle Corporation
dmi.board.version: 1.2
dmi.chassis.type: 1
dmi.chassis.vendor: Oracle Corporation
dmi.modalias: dmi:bvninnotekGmbH:bvrVirtualBox:bd12/01/2006:svninnotekGmbH:pnVirtualBox:pvr1.2:sku:rvnOracleCorporation:rnVirtualBox:rvr1.2:cvnOracleCorporation:ct1:cvr:
dmi.product.family: Virtual Machine
dmi.product.name: VirtualBox
dmi.product.version: 1.2
dmi.sys.vendor: innotek GmbH
To manage notifications about this bug go to:
https://bugs.launchpad.net/ubuntu/+source/systemd/+bug/1955085/+subscriptions
More information about the foundations-bugs
mailing list