[Bug 1851955] Re: ubuntu 19.10 boot installer failed

Sri 1851955 at bugs.launchpad.net
Mon Jan 6 17:46:14 UTC 2020


I started having this issue after I upgraded from Ubuntu 18.04 to 19.10
(through 18.10 and 19.04), everytime I try to run apt upgrade (or apt-
get upgrade). Here is an excerpt:

(When I was trying to install a new package, while an update was pending):
Unpacking atlassian-plugin-sdk (8.0.16) ...
Setting up grub-efi-amd64-signed (1.128.1+2.04-1ubuntu12.1) ...
Installing for x86_64-efi platform.
grub-install: warning: Cannot set EFI variable Boot0000.
grub-install: warning: efivarfs_set_variable: writing to fd 7 failed: Invalid argument.
grub-install: warning: _efi_set_variable_mode: ops->set_variable() failed: Invalid argument.
grub-install: error: failed to register the EFI boot entry: Invalid argument.
dpkg: error processing package grub-efi-amd64-signed (--configure):
 installed grub-efi-amd64-signed package post-installation script subprocess returned error exit status 1
Setting up atlassian-plugin-sdk (8.0.16) ...
If you previously installed a version prior to version 4.0, you will need to remove all references to the atlassian-plugin-sdk directory from your PATH environment variable.
dpkg: dependency problems prevent processing triggers for shim-signed:
 shim-signed depends on grub-efi-amd64-signed | grub-efi-arm64-signed; however:
  Package grub-efi-amd64-signed is not configured yet.
  Package grub-efi-arm64-signed is not installed.

dpkg: error processing package shim-signed (--configure):
 dependency problems - leaving triggers unprocessed
Errors were encountered while processing:
 grub-efi-amd64-signed
 shim-signed
E: Sub-process /usr/bin/dpkg returned an error code (1)


Any clue on where I should start looking?

-- 
You received this bug notification because you are a member of Ubuntu
Foundations Bugs, which is subscribed to shim-signed in Ubuntu.
https://bugs.launchpad.net/bugs/1851955

Title:
  ubuntu 19.10 boot installer failed

Status in shim-signed package in Ubuntu:
  Incomplete

Bug description:
  Installed on an ENVY notebook, installation afiled at the end with no
  bootloader message

  ProblemType: Bug
  DistroRelease: Ubuntu 19.10
  Package: ubiquity 19.10.21
  ProcVersionSignature: Ubuntu 5.3.0-18.19-generic 5.3.1
  Uname: Linux 5.3.0-18-generic x86_64
  NonfreeKernelModules: zfs zunicode zavl icp zcommon znvpair
  ApportVersion: 2.20.11-0ubuntu8
  Architecture: amd64
  CasperVersion: 1.427
  Date: Sun Nov 10 08:32:41 2019
  InstallCmdLine: file=/cdrom/preseed/ubuntu.seed initrd=/casper/initrd quiet splash --- maybe-ubiquity
  LiveMediaBuild: Ubuntu 19.10 "Eoan Ermine" - Release amd64 (20191017)
  SourcePackage: ubiquity
  UpgradeStatus: No upgrade log present (probably fresh install)

To manage notifications about this bug go to:
https://bugs.launchpad.net/ubuntu/+source/shim-signed/+bug/1851955/+subscriptions



More information about the foundations-bugs mailing list