[Bug 1862386] [NEW] package vim-runtime 2:7.4.1689-3ubuntu1.2 failed to install/upgrade: trying to overwrite '/usr/share/vim/vim74/doc/help.txt', which is also in package vim-tiny 2:7.4.1689-3ubuntu1.3
dprai
dibyaprakashrai at gmail.com
Fri Feb 7 16:01:31 UTC 2020
Public bug reported:
PDFCROP 1.38, 2012/11/02 - Copyright (c) 2002-2012 by Heiko Oberdiek.
kpathsea: Running mktexfmt pdftex.fmt
mktexfmt: mktexfmt is using the following fmtutil.cnf files (in precedence order):
mktexfmt: /usr/share/texmf/web2c/fmtutil.cnf
mktexfmt: mktexfmt is using the following fmtutil.cnf file for writing changes:
mktexfmt: /home/dprai/.texmf-config/web2c/fmtutil.cnf
mktexfmt [INFO]: writing formats under /home/dprai/.texmf-var/web2c
mktexfmt [INFO]: did not find entry for byfmt=pdftex, skipped
mktexfmt [INFO]: Not selected formats: 2
mktexfmt [INFO]: Total formats: 2
mktexfmt [INFO]: exiting with status 0
!!! Error: pdfTeX run failed with value 1!
ProblemType: Package
DistroRelease: Ubuntu 16.04
Package: vim-runtime 2:7.4.1689-3ubuntu1.2
ProcVersionSignature: Ubuntu 4.15.0-50.54~16.04.1-generic 4.15.18
Uname: Linux 4.15.0-50-generic x86_64
ApportVersion: 2.20.1-0ubuntu2.21
Architecture: amd64
Date: Fri Feb 7 21:24:31 2020
DpkgHistoryLog:
Start-Date: 2020-02-07 21:24:30
Commandline: apt-get -f install
Requested-By: dprai (1000)
Upgrade: vim-runtime:amd64 (2:7.4.1689-3ubuntu1.2, 2:7.4.1689-3ubuntu1.3)
DpkgTerminalLog:
Preparing to unpack .../vim-runtime_2%3a7.4.1689-3ubuntu1.3_all.deb ...
Unpacking vim-runtime (2:7.4.1689-3ubuntu1.3) over (2:7.4.1689-3ubuntu1.2) ...
dpkg: error processing archive /var/cache/apt/archives/vim-runtime_2%3a7.4.1689-3ubuntu1.3_all.deb (--unpack):
trying to overwrite '/usr/share/vim/vim74/doc/help.txt', which is also in package vim-tiny 2:7.4.1689-3ubuntu1.3
DuplicateSignature:
package:vim-runtime:2:7.4.1689-3ubuntu1.2
Unpacking vim-runtime (2:7.4.1689-3ubuntu1.3) over (2:7.4.1689-3ubuntu1.2) ...
dpkg: error processing archive /var/cache/apt/archives/vim-runtime_2%3a7.4.1689-3ubuntu1.3_all.deb (--unpack):
trying to overwrite '/usr/share/vim/vim74/doc/help.txt', which is also in package vim-tiny 2:7.4.1689-3ubuntu1.3
ErrorMessage: trying to overwrite '/usr/share/vim/vim74/doc/help.txt', which is also in package vim-tiny 2:7.4.1689-3ubuntu1.3
InstallationDate: Installed on 2018-12-24 (410 days ago)
InstallationMedia: Ubuntu 16.04.5 LTS "Xenial Xerus" - Release amd64 (20180731)
PackageArchitecture: all
RelatedPackageVersions:
dpkg 1.18.4ubuntu1.6
apt 1.2.32
SourcePackage: vim
Title: package vim-runtime 2:7.4.1689-3ubuntu1.2 failed to install/upgrade: trying to overwrite '/usr/share/vim/vim74/doc/help.txt', which is also in package vim-tiny 2:7.4.1689-3ubuntu1.3
UpgradeStatus: No upgrade log present (probably fresh install)
** Affects: vim (Ubuntu)
Importance: Undecided
Status: New
** Tags: amd64 apport-package package-conflict xenial
--
You received this bug notification because you are a member of Ubuntu
Foundations Bugs, which is subscribed to vim in Ubuntu.
https://bugs.launchpad.net/bugs/1862386
Title:
package vim-runtime 2:7.4.1689-3ubuntu1.2 failed to install/upgrade:
trying to overwrite '/usr/share/vim/vim74/doc/help.txt', which is also
in package vim-tiny 2:7.4.1689-3ubuntu1.3
Status in vim package in Ubuntu:
New
Bug description:
PDFCROP 1.38, 2012/11/02 - Copyright (c) 2002-2012 by Heiko Oberdiek.
kpathsea: Running mktexfmt pdftex.fmt
mktexfmt: mktexfmt is using the following fmtutil.cnf files (in precedence order):
mktexfmt: /usr/share/texmf/web2c/fmtutil.cnf
mktexfmt: mktexfmt is using the following fmtutil.cnf file for writing changes:
mktexfmt: /home/dprai/.texmf-config/web2c/fmtutil.cnf
mktexfmt [INFO]: writing formats under /home/dprai/.texmf-var/web2c
mktexfmt [INFO]: did not find entry for byfmt=pdftex, skipped
mktexfmt [INFO]: Not selected formats: 2
mktexfmt [INFO]: Total formats: 2
mktexfmt [INFO]: exiting with status 0
!!! Error: pdfTeX run failed with value 1!
ProblemType: Package
DistroRelease: Ubuntu 16.04
Package: vim-runtime 2:7.4.1689-3ubuntu1.2
ProcVersionSignature: Ubuntu 4.15.0-50.54~16.04.1-generic 4.15.18
Uname: Linux 4.15.0-50-generic x86_64
ApportVersion: 2.20.1-0ubuntu2.21
Architecture: amd64
Date: Fri Feb 7 21:24:31 2020
DpkgHistoryLog:
Start-Date: 2020-02-07 21:24:30
Commandline: apt-get -f install
Requested-By: dprai (1000)
Upgrade: vim-runtime:amd64 (2:7.4.1689-3ubuntu1.2, 2:7.4.1689-3ubuntu1.3)
DpkgTerminalLog:
Preparing to unpack .../vim-runtime_2%3a7.4.1689-3ubuntu1.3_all.deb ...
Unpacking vim-runtime (2:7.4.1689-3ubuntu1.3) over (2:7.4.1689-3ubuntu1.2) ...
dpkg: error processing archive /var/cache/apt/archives/vim-runtime_2%3a7.4.1689-3ubuntu1.3_all.deb (--unpack):
trying to overwrite '/usr/share/vim/vim74/doc/help.txt', which is also in package vim-tiny 2:7.4.1689-3ubuntu1.3
DuplicateSignature:
package:vim-runtime:2:7.4.1689-3ubuntu1.2
Unpacking vim-runtime (2:7.4.1689-3ubuntu1.3) over (2:7.4.1689-3ubuntu1.2) ...
dpkg: error processing archive /var/cache/apt/archives/vim-runtime_2%3a7.4.1689-3ubuntu1.3_all.deb (--unpack):
trying to overwrite '/usr/share/vim/vim74/doc/help.txt', which is also in package vim-tiny 2:7.4.1689-3ubuntu1.3
ErrorMessage: trying to overwrite '/usr/share/vim/vim74/doc/help.txt', which is also in package vim-tiny 2:7.4.1689-3ubuntu1.3
InstallationDate: Installed on 2018-12-24 (410 days ago)
InstallationMedia: Ubuntu 16.04.5 LTS "Xenial Xerus" - Release amd64 (20180731)
PackageArchitecture: all
RelatedPackageVersions:
dpkg 1.18.4ubuntu1.6
apt 1.2.32
SourcePackage: vim
Title: package vim-runtime 2:7.4.1689-3ubuntu1.2 failed to install/upgrade: trying to overwrite '/usr/share/vim/vim74/doc/help.txt', which is also in package vim-tiny 2:7.4.1689-3ubuntu1.3
UpgradeStatus: No upgrade log present (probably fresh install)
To manage notifications about this bug go to:
https://bugs.launchpad.net/ubuntu/+source/vim/+bug/1862386/+subscriptions
More information about the foundations-bugs
mailing list