[Bug 1870063] Re: libnet-server-perl ftbfs in focal
Steve Langasek
steve.langasek at canonical.com
Mon Apr 20 18:27:07 UTC 2020
** Changed in: libnet-server-perl (Ubuntu)
Status: In Progress => Fix Released
--
You received this bug notification because you are a member of Ubuntu
Foundations Bugs, which is subscribed to libnet-server-perl in Ubuntu.
https://bugs.launchpad.net/bugs/1870063
Title:
libnet-server-perl ftbfs in focal
Status in libnet-server-perl package in Ubuntu:
Fix Released
Bug description:
seen in the second focal test rebuild
Test Summary Report
-------------------
t/SSL_test.t (Wstat: 0 Tests: 5 Failed: 1)
Failed test: 5
t/SSLEAY_test.t (Wstat: 9 Tests: 4 Failed: 1)
Failed test: 4
Non-zero wait status: 9
Files=16, Tests=190, 36 wallclock secs ( 0.06 usr 0.02 sys + 0.83 cusr 0.20 csys = 1.11 CPU)
Result: FAIL
Failed 2/16 test programs. 2/190 subtests failed.
make[1]: *** [Makefile:933: test_dynamic] Error 255
make[1]: Leaving directory '/<<PKGBUILDDIR>>'
dh_auto_test: error: make -j4 test TEST_VERBOSE=1 returned exit code 2
make: *** [debian/rules:4: build] Error 25
dpkg-buildpackage: error: debian/rules build subprocess returned exit status 2
To manage notifications about this bug go to:
https://bugs.launchpad.net/ubuntu/+source/libnet-server-perl/+bug/1870063/+subscriptions
More information about the foundations-bugs
mailing list