[Bug 1870049] Re: aptdaemon ftbfs in focal
Julian Andres Klode
julian.klode at canonical.com
Wed Apr 1 14:28:11 UTC 2020
** Changed in: aptdaemon (Ubuntu)
Status: Confirmed => In Progress
** Changed in: aptdaemon (Ubuntu)
Assignee: (unassigned) => Julian Andres Klode (juliank)
--
You received this bug notification because you are a member of Ubuntu
Foundations Bugs, which is subscribed to aptdaemon in Ubuntu.
https://bugs.launchpad.net/bugs/1870049
Title:
aptdaemon ftbfs in focal
Status in aptdaemon package in Ubuntu:
In Progress
Bug description:
https://launchpadlibrarian.net/471776260/buildlog_ubuntu-focal-
amd64.aptdaemon_1.1.1+bzr982-0ubuntu31_BUILDING.txt.gz
aptdaemon ftbfs in focal:
dpkg-buildpackage: info: source package aptdaemon
dpkg-buildpackage: info: source version 1.1.1+bzr982-0ubuntu31
dpkg-buildpackage: info: source distribution focal
dpkg-source --before-build .
dpkg-buildpackage: info: host architecture amd64
fakeroot debian/rules clean
dh clean --with=python3,translations --buildsystem=pybuild
dh: error: unable to load addon python3: Can't locate Debian/Debhelper/Sequence/python3.pm in @INC (you may need to install the Debian::Debhelper::Sequence::python3 module) (@INC contains: /etc/perl /usr/local/lib/x86_64-linux-gnu/perl/5.30.0 /usr/local/share/perl/5.30.0 /usr/lib/x86_64-linux-gnu/perl5/5.30 /usr/share/perl5 /usr/lib/x86_64-linux-gnu/perl/5.30 /usr/share/perl/5.30 /usr/local/lib/site_perl /usr/lib/x86_64-linux-gnu/perl-base) at (eval 13) line 1.
BEGIN failed--compilation aborted at (eval 13) line 1.
make: *** [debian/rules:8: clean] Error 25
dpkg-buildpackage: error: fakeroot debian/rules clean subprocess returned exit status 2
To manage notifications about this bug go to:
https://bugs.launchpad.net/ubuntu/+source/aptdaemon/+bug/1870049/+subscriptions
More information about the foundations-bugs
mailing list