[Bug 1843735] [NEW] fwupd ftbfs in eoan
Matthias Klose
doko at ubuntu.com
Thu Sep 12 14:30:19 UTC 2019
Public bug reported:
all archs,
https://launchpadlibrarian.net/441262811/buildlog_ubuntu-eoan-amd64.fwupd_1.2.10-1ubuntu1_BUILDING.txt.gz
Ok: 13
Expected Fail: 0
Fail: 2
Unexpected Pass: 0
Skipped: 0
Timeout: 0
dh_auto_test: cd obj-x86_64-linux-gnu && LC_ALL=C.UTF-8 MESON_TESTTHREADS=4 ninja test returned exit code 1
make[1]: *** [debian/rules:97: override_dh_auto_test] Error 255
make[1]: Leaving directory '/<<PKGBUILDDIR>>'
make: *** [debian/rules:31: build] Error 2
** Affects: fwupd (Ubuntu)
Importance: High
Status: Confirmed
** Tags: ftbfs rls-ee-incoming
** Changed in: fwupd (Ubuntu)
Status: New => Confirmed
** Changed in: fwupd (Ubuntu)
Importance: Undecided => High
** Tags added: rls-ee-incoming
** Tags added: ftbfs
--
You received this bug notification because you are a member of Ubuntu
Foundations Bugs, which is subscribed to fwupd in Ubuntu.
https://bugs.launchpad.net/bugs/1843735
Title:
fwupd ftbfs in eoan
Status in fwupd package in Ubuntu:
Confirmed
Bug description:
all archs,
https://launchpadlibrarian.net/441262811/buildlog_ubuntu-eoan-amd64.fwupd_1.2.10-1ubuntu1_BUILDING.txt.gz
Ok: 13
Expected Fail: 0
Fail: 2
Unexpected Pass: 0
Skipped: 0
Timeout: 0
dh_auto_test: cd obj-x86_64-linux-gnu && LC_ALL=C.UTF-8 MESON_TESTTHREADS=4 ninja test returned exit code 1
make[1]: *** [debian/rules:97: override_dh_auto_test] Error 255
make[1]: Leaving directory '/<<PKGBUILDDIR>>'
make: *** [debian/rules:31: build] Error 2
To manage notifications about this bug go to:
https://bugs.launchpad.net/ubuntu/+source/fwupd/+bug/1843735/+subscriptions
More information about the foundations-bugs
mailing list