[Bug 1851542] Re: autopkgtest fails due to aspell SRU
Brian Murray
brian at ubuntu.com
Tue Nov 19 18:43:17 UTC 2019
Hello dann, or anyone else affected,
Accepted apport into eoan-proposed. The package will build now and be
available at
https://launchpad.net/ubuntu/+source/apport/2.20.11-0ubuntu8.3 in a few
hours, and then in the -proposed repository.
Please help us by testing this new package. See
https://wiki.ubuntu.com/Testing/EnableProposed for documentation on how
to enable and use -proposed. Your feedback will aid us getting this
update out to other Ubuntu users.
If this package fixes the bug for you, please add a comment to this bug,
mentioning the version of the package you tested and change the tag from
verification-needed-eoan to verification-done-eoan. If it does not fix
the bug for you, please add a comment stating that, and change the tag
to verification-failed-eoan. In either case, without details of your
testing we will not be able to proceed.
Further information regarding the verification process can be found at
https://wiki.ubuntu.com/QATeam/PerformingSRUVerification . Thank you in
advance for helping!
N.B. The updated package will be released to -updates after the bug(s)
fixed by this package have been verified and the package has been in
-proposed for a minimum of 7 days.
** Tags added: verification-needed verification-needed-eoan
--
You received this bug notification because you are a member of Ubuntu
Foundations Bugs, which is subscribed to apport in Ubuntu.
https://bugs.launchpad.net/bugs/1851542
Title:
autopkgtest fails due to aspell SRU
Status in apport package in Ubuntu:
Fix Released
Status in apport source package in Bionic:
Fix Committed
Status in apport source package in Disco:
Fix Committed
Status in apport source package in Eoan:
Fix Committed
Status in apport source package in Focal:
Fix Released
Bug description:
[Impact]
A new autopkgtest test regression began appearing after (and due to) an aspell SRU.
======================================================================
FAIL: test_install_packages_versioned (__main__.T)
install_packages() with versions and with cache
----------------------------------------------------------------------
Traceback (most recent call last):
File "./test_backend_apt_dpkg.py", line 557, in test_install_packages_versioned
self.assertIn(result, 'aspell-doc version 1.1 required, but 0.60.7~20110707-3build1 is available\n')
AssertionError: 'aspell-doc version 1.1 required, but 0.60.7~20110707-3ubuntu0.1 is available\n' not found in 'aspell-doc version 1.1 required, but 0.60.7~20110707-3build1 is available\n'
----------------------------------------------------------------------
Ran 37 tests in 191.123s
FAILED (failures=1)
[Test Case]
## From within autopkgtest source package, with autopkgtest deps installed
## This is a slightly modified version if debian/tests/upstream-system
# do not run in the source tree, as we want to check the system-installed
# apport
TESTDIR=${ADTTMP:-/tmp}/apport-tests
mkdir -p $TESTDIR
cp test/test_* test/run "$TESTDIR"
cd "$TESTDIR"
# clean up old crash reports
rm -rf /var/crash/*
export GNUPGHOME=$TESTDIR/gnupg
mkdir -m 700 $GNUPGHOME
./run backend_apt_dpkg
[Fix]
http://bazaar.launchpad.net/~ubuntu-core-dev/ubuntu/focal/apport/ubuntu/revision/2717
[Regression Risk]
Code is restricted to a test that is only ran via autopkgtest.
To manage notifications about this bug go to:
https://bugs.launchpad.net/ubuntu/+source/apport/+bug/1851542/+subscriptions
More information about the foundations-bugs
mailing list