[Bug 1852898] [NEW] package grub-efi-amd64-signed 1.66.23+2.02~beta2-36ubuntu3.23 failed to install/upgrade: subprocess installed post-installation script returned error exit status 1
sander
sandrosti at alice.it
Sun Nov 17 10:07:00 UTC 2019
*** This bug is a duplicate of bug 1852897 ***
https://bugs.launchpad.net/bugs/1852897
Public bug reported:
grub2-signed
ProblemType: Package
DistroRelease: Ubuntu 16.04
Package: grub-efi-amd64-signed 1.66.23+2.02~beta2-36ubuntu3.23
ProcVersionSignature: Ubuntu 4.15.0-70.79~16.04.1-generic 4.15.18
Uname: Linux 4.15.0-70-generic x86_64
ApportVersion: 2.20.1-0ubuntu2.21
Architecture: amd64
Date: Sun Nov 17 10:50:00 2019
DuplicateSignature:
package:grub-efi-amd64-signed:1.66.23+2.02~beta2-36ubuntu3.23
Setting up grub-efi-amd64-signed (1.66.23+2.02~beta2-36ubuntu3.23) ...
grub-install: error: /usr/lib/grub/i386-pc/modinfo.sh doesn't exist. Please specify --target or --directory.
dpkg: error processing package grub-efi-amd64-signed (--configure):
subprocess installed post-installation script returned error exit status 1
ErrorMessage: subprocess installed post-installation script returned error exit status 1
RelatedPackageVersions:
dpkg 1.18.4ubuntu1.6
apt 1.2.32
SourcePackage: grub2-signed
Title: package grub-efi-amd64-signed 1.66.23+2.02~beta2-36ubuntu3.23 failed to install/upgrade: subprocess installed post-installation script returned error exit status 1
UpgradeStatus: Upgraded to xenial on 2019-11-17 (0 days ago)
** Affects: grub2-signed (Ubuntu)
Importance: Undecided
Status: New
** Tags: amd64 apport-package third-party-packages xenial
--
You received this bug notification because you are a member of Ubuntu
Foundations Bugs, which is subscribed to grub2-signed in Ubuntu.
https://bugs.launchpad.net/bugs/1852898
Title:
package grub-efi-amd64-signed 1.66.23+2.02~beta2-36ubuntu3.23 failed
to install/upgrade: subprocess installed post-installation script
returned error exit status 1
Status in grub2-signed package in Ubuntu:
New
Bug description:
grub2-signed
ProblemType: Package
DistroRelease: Ubuntu 16.04
Package: grub-efi-amd64-signed 1.66.23+2.02~beta2-36ubuntu3.23
ProcVersionSignature: Ubuntu 4.15.0-70.79~16.04.1-generic 4.15.18
Uname: Linux 4.15.0-70-generic x86_64
ApportVersion: 2.20.1-0ubuntu2.21
Architecture: amd64
Date: Sun Nov 17 10:50:00 2019
DuplicateSignature:
package:grub-efi-amd64-signed:1.66.23+2.02~beta2-36ubuntu3.23
Setting up grub-efi-amd64-signed (1.66.23+2.02~beta2-36ubuntu3.23) ...
grub-install: error: /usr/lib/grub/i386-pc/modinfo.sh doesn't exist. Please specify --target or --directory.
dpkg: error processing package grub-efi-amd64-signed (--configure):
subprocess installed post-installation script returned error exit status 1
ErrorMessage: subprocess installed post-installation script returned error exit status 1
RelatedPackageVersions:
dpkg 1.18.4ubuntu1.6
apt 1.2.32
SourcePackage: grub2-signed
Title: package grub-efi-amd64-signed 1.66.23+2.02~beta2-36ubuntu3.23 failed to install/upgrade: subprocess installed post-installation script returned error exit status 1
UpgradeStatus: Upgraded to xenial on 2019-11-17 (0 days ago)
To manage notifications about this bug go to:
https://bugs.launchpad.net/ubuntu/+source/grub2-signed/+bug/1852898/+subscriptions
More information about the foundations-bugs
mailing list