[Bug 1823651] Re: vim ftbfs in cosmic (i386 only)
Mathieu Trudel-Lapierre
mathieu.tl at gmail.com
Tue Jun 25 18:38:33 UTC 2019
** Changed in: vim (Ubuntu)
Status: New => Invalid
--
You received this bug notification because you are a member of Ubuntu
Foundations Bugs, which is subscribed to vim in Ubuntu.
https://bugs.launchpad.net/bugs/1823651
Title:
vim ftbfs in cosmic (i386 only)
Status in vim package in Ubuntu:
Invalid
Bug description:
https://launchpadlibrarian.net/418305601/buildlog_ubuntu-
cosmic-i386.vim_2%3A8.0.1766-1ubuntu1_BUILDING.txt.gz
Executed 354 tests
From test_terminal.vim:
Found errors in Test_terminal_tmap():
First run:
Caught exception in Test_terminal_tmap(): WaitFor() timed out after 5000 msec @ function RunTheTest[38]..Test_terminal_tmap[1]..TerminalTmap[14]..WaitFor, line 25
Second run:
Caught exception in Test_terminal_tmap(): WaitFor() timed out after 5000 msec @ function RunTheTest[38]..Test_terminal_tmap[1]..TerminalTmap[14]..WaitFor, line 25
Test results:
From test_terminal.vim:
Found errors in Test_terminal_tmap():
First run:
Caught exception in Test_terminal_tmap(): WaitFor() timed out after 5000 msec @ function RunTheTest[38]..Test_terminal_tmap[1]..TerminalTmap[14]..WaitFor, line 25
Second run:
Caught exception in Test_terminal_tmap(): WaitFor() timed out after 5000 msec @ function RunTheTest[38]..Test_terminal_tmap[1]..TerminalTmap[14]..WaitFor, line 25
TEST FAILURE
make[2]: *** [Makefile:43: report] Error 1
make[2]: Leaving directory '/<<PKGBUILDDIR>>/src/vim-gtk3/testdir'
make[1]: *** [Makefile:2075: scripttests] Error 2
make[1]: Leaving directory '/<<PKGBUILDDIR>>/src/vim-gtk3'
make: *** [debian/rules:266: build-stamp-vim-gtk3] Error 2
To manage notifications about this bug go to:
https://bugs.launchpad.net/ubuntu/+source/vim/+bug/1823651/+subscriptions
More information about the foundations-bugs
mailing list