[Bug 1833234] [NEW] grub2 ftbfs in eoan

Matthias Klose doko at ubuntu.com
Tue Jun 18 12:38:32 UTC 2019


Public bug reported:

grub2 ftbfs in eoan.

https://launchpadlibrarian.net/428260665/buildlog_ubuntu-eoan-
amd64.grub2_2.02+dfsg1-12ubuntu2_BUILDING.txt.gz

FAIL: pata_test
===============

tar: Removing leading `/' from member names

FAIL: ahci_test
===============

tar: Removing leading `/' from member names

FAIL: uhci_test
===============

tar: Removing leading `/' from member names

FAIL: ohci_test
===============

tar: Removing leading `/' from member names

FAIL: ehci_test
===============

tar: Removing leading `/' from member names

FAIL: example_grub_script_test
==============================


FAIL: grub_script_eval
======================


FAIL: grub_script_test
======================


FAIL: grub_script_echo1
=======================


FAIL: grub_script_leading_whitespace
====================================


FAIL: grub_script_echo_keywords
===============================


FAIL: grub_script_vars1
=======================


FAIL: grub_script_for1
======================


FAIL: grub_script_while1
========================


FAIL: grub_script_if
====================


FAIL: grub_script_comments
==========================


FAIL: grub_script_functions
===========================


FAIL: grub_script_break
=======================


FAIL: grub_script_continue
==========================


FAIL: grub_script_shift
=======================


FAIL: grub_script_blockarg
==========================

[] != [{ true }]

FAIL: grub_script_setparams
===========================


FAIL: grub_script_return
========================


FAIL: grub_cmd_regexp
=====================


FAIL: grub_cmd_date
===================


SKIP: grub_cmd_set_date
=======================

Skipping flaky test.

FAIL: grub_cmd_sleep
====================


FAIL: grub_script_expansion
===========================


FAIL: grub_script_not
=====================


FAIL: partmap_test
==================

Checking MSDOS partition types...
1+0 records in
1+0 records out
/sys/firmware/dmi/tables/smbios_entry_point: Permission denied
/dev/mem: Permission denied
sh: 1: udevadm: not found
sh: 1: udevadm: not found

(hd0): disk/partiton not found

FAIL: hddboot_test
==================


FAIL: fddboot_test
==================


FAIL: cdboot_test
=================


FAIL: netboot_test
==================

./grub-mknetdir: error: Decompressor is too big.

FAIL: xzcompress_test
=====================


FAIL: gzcompress_test
=====================


SKIP: lzocompress_test
======================

lzop not installed; cannot test lzo compression.

FAIL: grub_cmd_echo
===================


FAIL: help_test
===============


FAIL: grub_script_gettext
=========================


FAIL: grub_script_escape_comma
==============================


FAIL: grub_script_strcmp
========================


FAIL: test_sha512sum
====================

GRUB sha512sum output did not match sha512sum output.
See diff -u /tmp/tmp.U6WWzPMCI0 /tmp/tmp.6TjD83G4wT

FAIL: test_unset
================


FAIL: grub_func_test
====================


FAIL: grub_cmd_tr
=================


FAIL: file_filter_test
======================


============================================================================
Testsuite summary for GRUB 2.02+dfsg1-12ubuntu2
============================================================================
# TOTAL: 81
# PASS:  17
# SKIP:  19
# XFAIL: 0
# FAIL:  45
# XPASS: 0
# ERROR: 0
============================================================================
See ./test-suite.log
Please report to bug-grub at gnu.org
============================================================================
make[6]: *** [Makefile:11548: test-suite.log] Error 1
make[6]: Leaving directory '/<<BUILDDIR>>/grub2-2.02+dfsg1/obj/grub-pc'
make[5]: *** [Makefile:11656: check-TESTS] Error 2
make[5]: Leaving directory '/<<BUILDDIR>>/grub2-2.02+dfsg1/obj/grub-pc'
make[4]: *** [Makefile:12448: check-am] Error 2
make[4]: Leaving directory '/<<BUILDDIR>>/grub2-2.02+dfsg1/obj/grub-pc'
make[3]: *** [Makefile:11433: check-recursive] Error 1
make[3]: Leaving directory '/<<BUILDDIR>>/grub2-2.02+dfsg1/obj/grub-pc'
make[2]: *** [Makefile:12450: check] Error 2
make[2]: Leaving directory '/<<BUILDDIR>>/grub2-2.02+dfsg1/obj/grub-pc'
dh_auto_test: cd obj/grub-pc && make -j1 check VERBOSE=1 returned exit code 2
make[1]: *** [debian/rules:273: debian/stamps/build-grub-pc] Error 2
make[1]: Leaving directory '/<<BUILDDIR>>/grub2-2.02+dfsg1'
make: *** [debian/rules:136: binary] Error 2
dpkg-buildpackage: error: debian/rules binary subprocess returned exit status 2

** Affects: grub2 (Ubuntu)
     Importance: Undecided
         Status: New


** Tags: ftbfs rls-ee-incoming

** Tags added: ftbfs rls-ee-incoming

-- 
You received this bug notification because you are a member of Ubuntu
Foundations Bugs, which is subscribed to grub2 in Ubuntu.
https://bugs.launchpad.net/bugs/1833234

Title:
  grub2 ftbfs in eoan

Status in grub2 package in Ubuntu:
  New

Bug description:
  grub2 ftbfs in eoan.

  https://launchpadlibrarian.net/428260665/buildlog_ubuntu-eoan-
  amd64.grub2_2.02+dfsg1-12ubuntu2_BUILDING.txt.gz

  FAIL: pata_test
  ===============

  tar: Removing leading `/' from member names

  FAIL: ahci_test
  ===============

  tar: Removing leading `/' from member names

  FAIL: uhci_test
  ===============

  tar: Removing leading `/' from member names

  FAIL: ohci_test
  ===============

  tar: Removing leading `/' from member names

  FAIL: ehci_test
  ===============

  tar: Removing leading `/' from member names

  FAIL: example_grub_script_test
  ==============================

  
  FAIL: grub_script_eval
  ======================

  
  FAIL: grub_script_test
  ======================

  
  FAIL: grub_script_echo1
  =======================

  
  FAIL: grub_script_leading_whitespace
  ====================================

  
  FAIL: grub_script_echo_keywords
  ===============================

  
  FAIL: grub_script_vars1
  =======================

  
  FAIL: grub_script_for1
  ======================

  
  FAIL: grub_script_while1
  ========================

  
  FAIL: grub_script_if
  ====================

  
  FAIL: grub_script_comments
  ==========================

  
  FAIL: grub_script_functions
  ===========================

  
  FAIL: grub_script_break
  =======================

  
  FAIL: grub_script_continue
  ==========================

  
  FAIL: grub_script_shift
  =======================

  
  FAIL: grub_script_blockarg
  ==========================

  [] != [{ true }]

  FAIL: grub_script_setparams
  ===========================

  
  FAIL: grub_script_return
  ========================

  
  FAIL: grub_cmd_regexp
  =====================

  
  FAIL: grub_cmd_date
  ===================

  
  SKIP: grub_cmd_set_date
  =======================

  Skipping flaky test.

  FAIL: grub_cmd_sleep
  ====================

  
  FAIL: grub_script_expansion
  ===========================

  
  FAIL: grub_script_not
  =====================

  
  FAIL: partmap_test
  ==================

  Checking MSDOS partition types...
  1+0 records in
  1+0 records out
  /sys/firmware/dmi/tables/smbios_entry_point: Permission denied
  /dev/mem: Permission denied
  sh: 1: udevadm: not found
  sh: 1: udevadm: not found

  (hd0): disk/partiton not found

  FAIL: hddboot_test
  ==================

  
  FAIL: fddboot_test
  ==================

  
  FAIL: cdboot_test
  =================

  
  FAIL: netboot_test
  ==================

  ./grub-mknetdir: error: Decompressor is too big.

  FAIL: xzcompress_test
  =====================

  
  FAIL: gzcompress_test
  =====================

  
  SKIP: lzocompress_test
  ======================

  lzop not installed; cannot test lzo compression.

  FAIL: grub_cmd_echo
  ===================

  
  FAIL: help_test
  ===============

  
  FAIL: grub_script_gettext
  =========================

  
  FAIL: grub_script_escape_comma
  ==============================

  
  FAIL: grub_script_strcmp
  ========================

  
  FAIL: test_sha512sum
  ====================

  GRUB sha512sum output did not match sha512sum output.
  See diff -u /tmp/tmp.U6WWzPMCI0 /tmp/tmp.6TjD83G4wT

  FAIL: test_unset
  ================

  
  FAIL: grub_func_test
  ====================

  
  FAIL: grub_cmd_tr
  =================

  
  FAIL: file_filter_test
  ======================

  
  ============================================================================
  Testsuite summary for GRUB 2.02+dfsg1-12ubuntu2
  ============================================================================
  # TOTAL: 81
  # PASS:  17
  # SKIP:  19
  # XFAIL: 0
  # FAIL:  45
  # XPASS: 0
  # ERROR: 0
  ============================================================================
  See ./test-suite.log
  Please report to bug-grub at gnu.org
  ============================================================================
  make[6]: *** [Makefile:11548: test-suite.log] Error 1
  make[6]: Leaving directory '/<<BUILDDIR>>/grub2-2.02+dfsg1/obj/grub-pc'
  make[5]: *** [Makefile:11656: check-TESTS] Error 2
  make[5]: Leaving directory '/<<BUILDDIR>>/grub2-2.02+dfsg1/obj/grub-pc'
  make[4]: *** [Makefile:12448: check-am] Error 2
  make[4]: Leaving directory '/<<BUILDDIR>>/grub2-2.02+dfsg1/obj/grub-pc'
  make[3]: *** [Makefile:11433: check-recursive] Error 1
  make[3]: Leaving directory '/<<BUILDDIR>>/grub2-2.02+dfsg1/obj/grub-pc'
  make[2]: *** [Makefile:12450: check] Error 2
  make[2]: Leaving directory '/<<BUILDDIR>>/grub2-2.02+dfsg1/obj/grub-pc'
  dh_auto_test: cd obj/grub-pc && make -j1 check VERBOSE=1 returned exit code 2
  make[1]: *** [debian/rules:273: debian/stamps/build-grub-pc] Error 2
  make[1]: Leaving directory '/<<BUILDDIR>>/grub2-2.02+dfsg1'
  make: *** [debian/rules:136: binary] Error 2
  dpkg-buildpackage: error: debian/rules binary subprocess returned exit status 2

To manage notifications about this bug go to:
https://bugs.launchpad.net/ubuntu/+source/grub2/+bug/1833234/+subscriptions



More information about the foundations-bugs mailing list