[Bug 1795853] [NEW] ndiswrapper-dkms 1.60-6: ndiswrapper kernel module failed to build when istalling from apt-get
Diego Romano
1795853 at bugs.launchpad.net
Wed Oct 3 10:40:40 UTC 2018
Public bug reported:
> lsb_release -rd
Description: Ubuntu 18.04.1 LTS
Release: 18.04
--------------------------------------
> apt-cache policy ndiswrapper-dkms
ndiswrapper-dkms:
Installato: 1.60-6
Candidato: 1.60-6
Tabella versione:
*** 1.60-6 500
500 http://it.archive.ubuntu.com/ubuntu bionic/universe amd64 Packages
500 http://it.archive.ubuntu.com/ubuntu bionic/universe i386 Packages
100 /var/lib/dpkg/status
--------------------------------------
when installing via apt-get:
Loading new ndiswrapper-1.60 DKMS files...
Building for 4.15.0-34-generic 4.15.0-36-generic
Building initial module for 4.15.0-34-generic
Done.
ndiswrapper:
Running module version sanity check.
- Original module
- No original module exists within this kernel
- Installation
- Installing to /lib/modules/4.15.0-34-generic/updates/dkms/
depmod...
DKMS: install completed.
Building initial module for 4.15.0-36-generic
Error! Bad return status for module build on kernel: 4.15.0-36-generic (x86_64)
Consult /var/lib/dkms/ndiswrapper/1.60/build/make.log for more information.
---------------------------------------
contents of the log file:
DKMS make.log for ndiswrapper-1.60 for kernel 4.15.0-36-generic (x86_64)
mer 3 ott 2018, 12.29.37, CEST
make: ingresso nella directory "/usr/src/linux-headers-4.15.0-36-generic"
MKEXPORT /var/lib/dkms/ndiswrapper/1.60/build/crt_exports.h
MKEXPORT /var/lib/dkms/ndiswrapper/1.60/build/hal_exports.h
MKEXPORT /var/lib/dkms/ndiswrapper/1.60/build/ndis_exports.h
MKEXPORT /var/lib/dkms/ndiswrapper/1.60/build/ntoskernel_exports.h
MKEXPORT /var/lib/dkms/ndiswrapper/1.60/build/ntoskernel_io_exports.h
MKEXPORT /var/lib/dkms/ndiswrapper/1.60/build/rtl_exports.h
MKEXPORT /var/lib/dkms/ndiswrapper/1.60/build/usb_exports.h
MKSTUBS /var/lib/dkms/ndiswrapper/1.60/build/win2lin_stubs.h
CC [M] /var/lib/dkms/ndiswrapper/1.60/build/crt.o
CC [M] /var/lib/dkms/ndiswrapper/1.60/build/hal.o
CC [M] /var/lib/dkms/ndiswrapper/1.60/build/iw_ndis.o
CC [M] /var/lib/dkms/ndiswrapper/1.60/build/loader.o
symbolmap: sezione: invalid section
CC [M] /var/lib/dkms/ndiswrapper/1.60/build/ndis.o
CC [M] /var/lib/dkms/ndiswrapper/1.60/build/ntoskernel.o
CC [M] /var/lib/dkms/ndiswrapper/1.60/build/ntoskernel_io.o
CC [M] /var/lib/dkms/ndiswrapper/1.60/build/pe_linker.o
CC [M] /var/lib/dkms/ndiswrapper/1.60/build/pnp.o
CC [M] /var/lib/dkms/ndiswrapper/1.60/build/proc.o
symbolmap: sezione: invalid section
CC [M] /var/lib/dkms/ndiswrapper/1.60/build/rtl.o
symbolmap: sezione: invalid section
CC [M] /var/lib/dkms/ndiswrapper/1.60/build/wrapmem.o
CC [M] /var/lib/dkms/ndiswrapper/1.60/build/wrapndis.o
CC [M] /var/lib/dkms/ndiswrapper/1.60/build/wrapper.o
Assembler messages:
Internal error (Errore di segmentazione).
Please report this bug.
CC [M] /var/lib/dkms/ndiswrapper/1.60/build/usb.o
AS [M] /var/lib/dkms/ndiswrapper/1.60/build/win2lin_stubs.o
scripts/Makefile.build:332: recipe for target '/var/lib/dkms/ndiswrapper/1.60/build/wrapper.o' failed
make[1]: *** [/var/lib/dkms/ndiswrapper/1.60/build/wrapper.o] Error 2
make[1]: *** Attesa per i processi non terminati....
symbolmap: sezione: invalid section
symbolmap: sezione: invalid section
Makefile:1551: recipe for target '_module_/var/lib/dkms/ndiswrapper/1.60/build' failed
make: *** [_module_/var/lib/dkms/ndiswrapper/1.60/build] Error 2
make: uscita dalla directory "/usr/src/linux-headers-4.15.0-36-generic"
ProblemType: Package
DistroRelease: Ubuntu 18.04
Package: ndiswrapper-dkms 1.60-6
ProcVersionSignature: Ubuntu 4.15.0-34.37-generic 4.15.18
Uname: Linux 4.15.0-34-generic x86_64
ApportVersion: 2.20.9-0ubuntu7.4
Architecture: amd64
DKMSKernelVersion: 4.15.0-36-generic
Date: Wed Oct 3 12:29:45 2018
InstallationDate: Installed on 2016-01-25 (981 days ago)
InstallationMedia: Ubuntu 14.04.3 LTS "Trusty Tahr" - Beta amd64 (20150805)
PackageArchitecture: all
PackageVersion: 1.60-6
Python3Details: /usr/bin/python3.6, Python 3.6.6, python3-minimal, 3.6.5-3ubuntu1
PythonDetails: /usr/bin/python2.7, Python 2.7.15rc1, python-minimal, 2.7.15~rc1-1
RelatedPackageVersions:
dpkg 1.19.0.5ubuntu2
apt 1.6.3ubuntu0.1
SourcePackage: ndiswrapper
Title: ndiswrapper-dkms 1.60-6: ndiswrapper kernel module failed to build
UpgradeStatus: No upgrade log present (probably fresh install)
** Affects: ndiswrapper (Ubuntu)
Importance: Undecided
Status: New
** Tags: amd64 apport-package bionic
--
You received this bug notification because you are a member of Ubuntu
Foundations Bugs, which is subscribed to ndiswrapper in Ubuntu.
https://bugs.launchpad.net/bugs/1795853
Title:
ndiswrapper-dkms 1.60-6: ndiswrapper kernel module failed to build
when istalling from apt-get
Status in ndiswrapper package in Ubuntu:
New
Bug description:
> lsb_release -rd
Description: Ubuntu 18.04.1 LTS
Release: 18.04
--------------------------------------
> apt-cache policy ndiswrapper-dkms
ndiswrapper-dkms:
Installato: 1.60-6
Candidato: 1.60-6
Tabella versione:
*** 1.60-6 500
500 http://it.archive.ubuntu.com/ubuntu bionic/universe amd64 Packages
500 http://it.archive.ubuntu.com/ubuntu bionic/universe i386 Packages
100 /var/lib/dpkg/status
--------------------------------------
when installing via apt-get:
Loading new ndiswrapper-1.60 DKMS files...
Building for 4.15.0-34-generic 4.15.0-36-generic
Building initial module for 4.15.0-34-generic
Done.
ndiswrapper:
Running module version sanity check.
- Original module
- No original module exists within this kernel
- Installation
- Installing to /lib/modules/4.15.0-34-generic/updates/dkms/
depmod...
DKMS: install completed.
Building initial module for 4.15.0-36-generic
Error! Bad return status for module build on kernel: 4.15.0-36-generic (x86_64)
Consult /var/lib/dkms/ndiswrapper/1.60/build/make.log for more information.
---------------------------------------
contents of the log file:
DKMS make.log for ndiswrapper-1.60 for kernel 4.15.0-36-generic (x86_64)
mer 3 ott 2018, 12.29.37, CEST
make: ingresso nella directory "/usr/src/linux-headers-4.15.0-36-generic"
MKEXPORT /var/lib/dkms/ndiswrapper/1.60/build/crt_exports.h
MKEXPORT /var/lib/dkms/ndiswrapper/1.60/build/hal_exports.h
MKEXPORT /var/lib/dkms/ndiswrapper/1.60/build/ndis_exports.h
MKEXPORT /var/lib/dkms/ndiswrapper/1.60/build/ntoskernel_exports.h
MKEXPORT /var/lib/dkms/ndiswrapper/1.60/build/ntoskernel_io_exports.h
MKEXPORT /var/lib/dkms/ndiswrapper/1.60/build/rtl_exports.h
MKEXPORT /var/lib/dkms/ndiswrapper/1.60/build/usb_exports.h
MKSTUBS /var/lib/dkms/ndiswrapper/1.60/build/win2lin_stubs.h
CC [M] /var/lib/dkms/ndiswrapper/1.60/build/crt.o
CC [M] /var/lib/dkms/ndiswrapper/1.60/build/hal.o
CC [M] /var/lib/dkms/ndiswrapper/1.60/build/iw_ndis.o
CC [M] /var/lib/dkms/ndiswrapper/1.60/build/loader.o
symbolmap: sezione: invalid section
CC [M] /var/lib/dkms/ndiswrapper/1.60/build/ndis.o
CC [M] /var/lib/dkms/ndiswrapper/1.60/build/ntoskernel.o
CC [M] /var/lib/dkms/ndiswrapper/1.60/build/ntoskernel_io.o
CC [M] /var/lib/dkms/ndiswrapper/1.60/build/pe_linker.o
CC [M] /var/lib/dkms/ndiswrapper/1.60/build/pnp.o
CC [M] /var/lib/dkms/ndiswrapper/1.60/build/proc.o
symbolmap: sezione: invalid section
CC [M] /var/lib/dkms/ndiswrapper/1.60/build/rtl.o
symbolmap: sezione: invalid section
CC [M] /var/lib/dkms/ndiswrapper/1.60/build/wrapmem.o
CC [M] /var/lib/dkms/ndiswrapper/1.60/build/wrapndis.o
CC [M] /var/lib/dkms/ndiswrapper/1.60/build/wrapper.o
Assembler messages:
Internal error (Errore di segmentazione).
Please report this bug.
CC [M] /var/lib/dkms/ndiswrapper/1.60/build/usb.o
AS [M] /var/lib/dkms/ndiswrapper/1.60/build/win2lin_stubs.o
scripts/Makefile.build:332: recipe for target '/var/lib/dkms/ndiswrapper/1.60/build/wrapper.o' failed
make[1]: *** [/var/lib/dkms/ndiswrapper/1.60/build/wrapper.o] Error 2
make[1]: *** Attesa per i processi non terminati....
symbolmap: sezione: invalid section
symbolmap: sezione: invalid section
Makefile:1551: recipe for target '_module_/var/lib/dkms/ndiswrapper/1.60/build' failed
make: *** [_module_/var/lib/dkms/ndiswrapper/1.60/build] Error 2
make: uscita dalla directory "/usr/src/linux-headers-4.15.0-36-generic"
ProblemType: Package
DistroRelease: Ubuntu 18.04
Package: ndiswrapper-dkms 1.60-6
ProcVersionSignature: Ubuntu 4.15.0-34.37-generic 4.15.18
Uname: Linux 4.15.0-34-generic x86_64
ApportVersion: 2.20.9-0ubuntu7.4
Architecture: amd64
DKMSKernelVersion: 4.15.0-36-generic
Date: Wed Oct 3 12:29:45 2018
InstallationDate: Installed on 2016-01-25 (981 days ago)
InstallationMedia: Ubuntu 14.04.3 LTS "Trusty Tahr" - Beta amd64 (20150805)
PackageArchitecture: all
PackageVersion: 1.60-6
Python3Details: /usr/bin/python3.6, Python 3.6.6, python3-minimal, 3.6.5-3ubuntu1
PythonDetails: /usr/bin/python2.7, Python 2.7.15rc1, python-minimal, 2.7.15~rc1-1
RelatedPackageVersions:
dpkg 1.19.0.5ubuntu2
apt 1.6.3ubuntu0.1
SourcePackage: ndiswrapper
Title: ndiswrapper-dkms 1.60-6: ndiswrapper kernel module failed to build
UpgradeStatus: No upgrade log present (probably fresh install)
To manage notifications about this bug go to:
https://bugs.launchpad.net/ubuntu/+source/ndiswrapper/+bug/1795853/+subscriptions
More information about the foundations-bugs
mailing list