[Bug 1803436] [NEW] package grub-common 2.02~beta3-4ubuntu7.1 failed to install/upgrade: il sottoprocesso nuovo script pre-removal ha restituito lo stato di errore 127
Luciano Livio
luciano.livio at gmail.com
Wed Nov 14 19:53:55 UTC 2018
Public bug reported:
$ sudo apt full-upgrade
Lettura elenco dei pacchetti... Fatto
Generazione albero delle dipendenze
Lettura informazioni sullo stato... Fatto
È utile eseguire "apt --fix-broken install" per correggere ciò.
I seguenti pacchetti hanno dipendenze non soddisfatte:
grub-pc : Dipende: grub-common (= 2.02~beta3-4ubuntu7.3)
grub-pc-bin : Dipende: grub-common (= 2.02~beta3-4ubuntu7.3)
grub2-common : Dipende: grub-common (= 2.02~beta3-4ubuntu7.3)
libpam-modules : Pre-dipende: libpam-modules-bin (= 1.1.8-3.2ubuntu3)
Raccomanda: update-motd ma non è installato
mysql-server-5.7 : Dipende: mysql-server-core-5.7 (= 5.7.21-0ubuntu0.17.10.1) ma la versione 5.7.22-0ubuntu0.17.10.1 è installata
E: Dipendenze non soddisfatte. Provare "apt --fix-broken install" senza pacchetti (o specificare una soluzione).
matrix at matrix-desktop:~$ sudo apt --fix-broken install
Lettura elenco dei pacchetti... Fatto
Generazione albero delle dipendenze
Lettura informazioni sullo stato... Fatto
Correzione delle dipendenze... Fatto
The following additional packages will be installed:
grub-common libpam-modules mysql-server-5.7
Pacchetti suggeriti:
multiboot-doc grub-emu xorriso desktop-base mailx tinyca
Pacchetti raccomandati:
update-motd
I seguenti pacchetti saranno aggiornati:
grub-common libpam-modules mysql-server-5.7
3 aggiornati, 0 installati, 0 da rimuovere e 140 non aggiornati.
103 non completamente installati o rimossi.
È necessario scaricare 0 B/5.199 kB di archivi.
Dopo quest'operazione, verranno liberati 55,3 kB di spazio su disco.
Continuare? [S/n] s
Preconfigurazione dei pacchetti in corso
(Lettura del database... 249626 file e directory attualmente installati.)
Preparativi per estrarre .../grub-common_2.02~beta3-4ubuntu7.3_amd64.deb...
/var/lib/dpkg/info/grub-common.prerm: 11: /var/lib/dpkg/info/grub-common.prerm: invoke-rc.d: not found
dpkg: attenzione: il sottoprocesso vecchio script di pre-removal ha restituito lo stato di errore 127
dpkg: viene provato lo script dal nuovo pacchetto...
/var/lib/dpkg/tmp.ci/prerm: 11: /var/lib/dpkg/tmp.ci/prerm: invoke-rc.d: not found
dpkg: errore nell'elaborare l'archivio /var/cache/apt/archives/grub-common_2.02~beta3-4ubuntu7.3_amd64.deb (--unpack):
il sottoprocesso nuovo script pre-removal ha restituito lo stato di errore 127
update-rc.d: warning: start and stop actions are no longer supported; falling back to defaults
/var/lib/dpkg/info/grub-common.postinst: 7: /var/lib/dpkg/info/grub-common.postinst: invoke-rc.d: not found
dpkg: error while cleaning up:
il sottoprocesso installato script di post-installation ha restituito lo stato di errore 127
Preparativi per estrarre .../mysql-server-5.7_5.7.22-0ubuntu0.17.10.1_amd64.deb...
/var/lib/dpkg/info/mysql-server-5.7.prerm: riga 12: invoke-rc.d: comando non trovato
dpkg: attenzione: il sottoprocesso vecchio script di pre-removal ha restituito lo stato di errore 127
dpkg: viene provato lo script dal nuovo pacchetto...
/var/lib/dpkg/tmp.ci/prerm: riga 12: invoke-rc.d: comando non trovato
dpkg: errore nell'elaborare l'archivio /var/cache/apt/archives/mysql-server-5.7_5.7.22-0ubuntu0.17.10.1_amd64.deb (--unpack):
il sottoprocesso nuovo script pre-removal ha restituito lo stato di errore 127
Usage: /etc/init.d/mysql start|stop|restart|reload|force-reload|status
dpkg: error while cleaning up:
il sottoprocesso installato script di post-installation ha restituito lo stato di errore 1
Si sono verificati degli errori nell'elaborazione:
/var/cache/apt/archives/grub-common_2.02~beta3-4ubuntu7.3_amd64.deb
/var/cache/apt/archives/mysql-server-5.7_5.7.22-0ubuntu0.17.10.1_amd64.deb
E: Sub-process /usr/bin/dpkg returned an error code (1)
matrix at matrix-desktop:~$
ProblemType: Package
DistroRelease: Ubuntu 17.10
Package: grub-common 2.02~beta3-4ubuntu7.1
ProcVersionSignature: Ubuntu 4.13.0-36.40-generic 4.13.13
Uname: Linux 4.13.0-36-generic x86_64
ApportVersion: 2.20.7-0ubuntu3.7
Architecture: amd64
Date: Wed Nov 14 20:50:27 2018
DpkgHistoryLog:
Start-Date: 2018-11-14 20:50:24
Commandline: apt --fix-broken install
Requested-By: matrix (1000)
Upgrade: libpam-modules:amd64 (1.1.8-3.2ubuntu3, 1.1.8-3.2ubuntu3.1), mysql-server-5.7:amd64 (5.7.21-0ubuntu0.17.10.1, 5.7.22-0ubuntu0.17.10.1), grub-common:amd64 (2.02~beta3-4ubuntu7.1, 2.02~beta3-4ubuntu7.3)
ErrorMessage: il sottoprocesso nuovo script pre-removal ha restituito lo stato di errore 127
InstallationDate: Installed on 2018-01-17 (301 days ago)
InstallationMedia: Lubuntu 17.10 "Artful Aardvark" - Release amd64 (20180105)
ProcCmdLine: BOOT_IMAGE=/boot/vmlinuz-4.13.0-36-generic root=UUID=612ee599-7995-4241-b57c-2739ca55bf9d ro quiet splash vt.handoff=7
Python3Details: /usr/bin/python3.6, Python 3.6.3, python3-minimal, 3.6.3-0ubuntu2
PythonDetails: /usr/bin/python2.7, Python 2.7.14, python-minimal, 2.7.14-2ubuntu1
RelatedPackageVersions:
dpkg 1.18.24ubuntu1
apt 1.5.1
SourcePackage: grub2
Title: package grub-common 2.02~beta3-4ubuntu7.1 failed to install/upgrade: il sottoprocesso nuovo script pre-removal ha restituito lo stato di errore 127
UpgradeStatus: No upgrade log present (probably fresh install)
** Affects: grub2 (Ubuntu)
Importance: Undecided
Status: New
** Tags: amd64 apport-package artful
--
You received this bug notification because you are a member of Ubuntu
Foundations Bugs, which is subscribed to grub2 in Ubuntu.
https://bugs.launchpad.net/bugs/1803436
Title:
package grub-common 2.02~beta3-4ubuntu7.1 failed to install/upgrade:
il sottoprocesso nuovo script pre-removal ha restituito lo stato di
errore 127
Status in grub2 package in Ubuntu:
New
Bug description:
$ sudo apt full-upgrade
Lettura elenco dei pacchetti... Fatto
Generazione albero delle dipendenze
Lettura informazioni sullo stato... Fatto
È utile eseguire "apt --fix-broken install" per correggere ciò.
I seguenti pacchetti hanno dipendenze non soddisfatte:
grub-pc : Dipende: grub-common (= 2.02~beta3-4ubuntu7.3)
grub-pc-bin : Dipende: grub-common (= 2.02~beta3-4ubuntu7.3)
grub2-common : Dipende: grub-common (= 2.02~beta3-4ubuntu7.3)
libpam-modules : Pre-dipende: libpam-modules-bin (= 1.1.8-3.2ubuntu3)
Raccomanda: update-motd ma non è installato
mysql-server-5.7 : Dipende: mysql-server-core-5.7 (= 5.7.21-0ubuntu0.17.10.1) ma la versione 5.7.22-0ubuntu0.17.10.1 è installata
E: Dipendenze non soddisfatte. Provare "apt --fix-broken install" senza pacchetti (o specificare una soluzione).
matrix at matrix-desktop:~$ sudo apt --fix-broken install
Lettura elenco dei pacchetti... Fatto
Generazione albero delle dipendenze
Lettura informazioni sullo stato... Fatto
Correzione delle dipendenze... Fatto
The following additional packages will be installed:
grub-common libpam-modules mysql-server-5.7
Pacchetti suggeriti:
multiboot-doc grub-emu xorriso desktop-base mailx tinyca
Pacchetti raccomandati:
update-motd
I seguenti pacchetti saranno aggiornati:
grub-common libpam-modules mysql-server-5.7
3 aggiornati, 0 installati, 0 da rimuovere e 140 non aggiornati.
103 non completamente installati o rimossi.
È necessario scaricare 0 B/5.199 kB di archivi.
Dopo quest'operazione, verranno liberati 55,3 kB di spazio su disco.
Continuare? [S/n] s
Preconfigurazione dei pacchetti in corso
(Lettura del database... 249626 file e directory attualmente installati.)
Preparativi per estrarre .../grub-common_2.02~beta3-4ubuntu7.3_amd64.deb...
/var/lib/dpkg/info/grub-common.prerm: 11: /var/lib/dpkg/info/grub-common.prerm: invoke-rc.d: not found
dpkg: attenzione: il sottoprocesso vecchio script di pre-removal ha restituito lo stato di errore 127
dpkg: viene provato lo script dal nuovo pacchetto...
/var/lib/dpkg/tmp.ci/prerm: 11: /var/lib/dpkg/tmp.ci/prerm: invoke-rc.d: not found
dpkg: errore nell'elaborare l'archivio /var/cache/apt/archives/grub-common_2.02~beta3-4ubuntu7.3_amd64.deb (--unpack):
il sottoprocesso nuovo script pre-removal ha restituito lo stato di errore 127
update-rc.d: warning: start and stop actions are no longer supported; falling back to defaults
/var/lib/dpkg/info/grub-common.postinst: 7: /var/lib/dpkg/info/grub-common.postinst: invoke-rc.d: not found
dpkg: error while cleaning up:
il sottoprocesso installato script di post-installation ha restituito lo stato di errore 127
Preparativi per estrarre .../mysql-server-5.7_5.7.22-0ubuntu0.17.10.1_amd64.deb...
/var/lib/dpkg/info/mysql-server-5.7.prerm: riga 12: invoke-rc.d: comando non trovato
dpkg: attenzione: il sottoprocesso vecchio script di pre-removal ha restituito lo stato di errore 127
dpkg: viene provato lo script dal nuovo pacchetto...
/var/lib/dpkg/tmp.ci/prerm: riga 12: invoke-rc.d: comando non trovato
dpkg: errore nell'elaborare l'archivio /var/cache/apt/archives/mysql-server-5.7_5.7.22-0ubuntu0.17.10.1_amd64.deb (--unpack):
il sottoprocesso nuovo script pre-removal ha restituito lo stato di errore 127
Usage: /etc/init.d/mysql start|stop|restart|reload|force-reload|status
dpkg: error while cleaning up:
il sottoprocesso installato script di post-installation ha restituito lo stato di errore 1
Si sono verificati degli errori nell'elaborazione:
/var/cache/apt/archives/grub-common_2.02~beta3-4ubuntu7.3_amd64.deb
/var/cache/apt/archives/mysql-server-5.7_5.7.22-0ubuntu0.17.10.1_amd64.deb
E: Sub-process /usr/bin/dpkg returned an error code (1)
matrix at matrix-desktop:~$
ProblemType: Package
DistroRelease: Ubuntu 17.10
Package: grub-common 2.02~beta3-4ubuntu7.1
ProcVersionSignature: Ubuntu 4.13.0-36.40-generic 4.13.13
Uname: Linux 4.13.0-36-generic x86_64
ApportVersion: 2.20.7-0ubuntu3.7
Architecture: amd64
Date: Wed Nov 14 20:50:27 2018
DpkgHistoryLog:
Start-Date: 2018-11-14 20:50:24
Commandline: apt --fix-broken install
Requested-By: matrix (1000)
Upgrade: libpam-modules:amd64 (1.1.8-3.2ubuntu3, 1.1.8-3.2ubuntu3.1), mysql-server-5.7:amd64 (5.7.21-0ubuntu0.17.10.1, 5.7.22-0ubuntu0.17.10.1), grub-common:amd64 (2.02~beta3-4ubuntu7.1, 2.02~beta3-4ubuntu7.3)
ErrorMessage: il sottoprocesso nuovo script pre-removal ha restituito lo stato di errore 127
InstallationDate: Installed on 2018-01-17 (301 days ago)
InstallationMedia: Lubuntu 17.10 "Artful Aardvark" - Release amd64 (20180105)
ProcCmdLine: BOOT_IMAGE=/boot/vmlinuz-4.13.0-36-generic root=UUID=612ee599-7995-4241-b57c-2739ca55bf9d ro quiet splash vt.handoff=7
Python3Details: /usr/bin/python3.6, Python 3.6.3, python3-minimal, 3.6.3-0ubuntu2
PythonDetails: /usr/bin/python2.7, Python 2.7.14, python-minimal, 2.7.14-2ubuntu1
RelatedPackageVersions:
dpkg 1.18.24ubuntu1
apt 1.5.1
SourcePackage: grub2
Title: package grub-common 2.02~beta3-4ubuntu7.1 failed to install/upgrade: il sottoprocesso nuovo script pre-removal ha restituito lo stato di errore 127
UpgradeStatus: No upgrade log present (probably fresh install)
To manage notifications about this bug go to:
https://bugs.launchpad.net/ubuntu/+source/grub2/+bug/1803436/+subscriptions
More information about the foundations-bugs
mailing list