[Bug 1766740] Re: apport autopkgtest regression due to kernel packaging changes
Brian Murray
brian at ubuntu.com
Fri Jun 1 14:18:00 UTC 2018
The version of apport in bionic-proposed passed its autopkgtests now.
https://objectstorage.prodstack4-5.canonical.com/v1/AUTH_77e2ada1e7a84929a74ba3b87153c0ac
/autopkgtest-bionic/bionic/amd64/a/apport/20180531_171006_423ee@/log.gz
** Tags removed: verification-needed verification-needed-bionic
** Tags added: verification-done verification-done-bionic
--
You received this bug notification because you are a member of Ubuntu
Foundations Bugs, which is subscribed to apport in Ubuntu.
https://bugs.launchpad.net/bugs/1766740
Title:
apport autopkgtest regression due to kernel packaging changes
Status in apport package in Ubuntu:
Fix Released
Status in apport source package in Bionic:
Fix Committed
Bug description:
[SRU Justification]
In bionic, linux-image-$kvers-$flavor is now built from the linux-signed source package on amd64, not from the linux source package. This now causes a test to fail in the apport test suite:
[...]
======================================================================
FAIL: test_run_crash_kernel (__main__.T)
run_crash() for a kernel error
----------------------------------------------------------------------
Traceback (most recent call last):
File "./test_ui.py", line 1305, in test_run_crash_kernel
self.assertEqual(self.ui.opened_url, 'http://linux.bugs.example.com/%i' % se
lf.ui.crashdb.latest_id())
AssertionError: 'http://linux-signed.bugs.example.com/5' != 'http://linux.bugs.e
xample.com/5'
- http://linux-signed.bugs.example.com/5
? -------
+ http://linux.bugs.example.com/5
----------------------------------------------------------------------
Ran 70 tests in 79.815s
FAILED (failures=1)
[...]
(https://objectstorage.prodstack4-5.canonical.com/v1/AUTH_77e2ada1e7a84929a74ba3b87153c0ac
/autopkgtest-
bionic/bionic/amd64/a/apport/20180424_222219_45dc8@/log.gz)
This test needs to be fixed to know about the packaging change.
Note that this packaging change is expected to soon be SRUed back to
all Ubuntu releases, so apport's testsuite change should also be
SRUed.
[Test case]
This passes if the autopkgtests pass.
[Regression potential]
The test could be changed to pass while leaving underlying issues in the code. This has probably not happened here.
To manage notifications about this bug go to:
https://bugs.launchpad.net/ubuntu/+source/apport/+bug/1766740/+subscriptions
More information about the foundations-bugs
mailing list