[Bug 1779431] Re: package samba 2:4.7.6+dfsg~ubuntu-0ubuntu2 failedto install/upgrade: installed samba package post-installation scriptsubprocess returned error exit status 1
Gaetano Giacalong
1779431 at bugs.launchpad.net
Mon Jul 2 20:47:22 UTC 2018
You are correct. I apologize for submitting a bug that is not a bug. I
guess I got lazy. I found my problem and fixed it.
You can close this.
Regards
Gaetano
Sent from Mail for Windows 10
From: Andreas Hasenack
Sent: Monday, July 2, 2018 10:46 AM
To: dagman62 at gmail.com
Subject: [Bug 1779431] Re: package samba 2:4.7.6+dfsg~ubuntu-0ubuntu2 failedto install/upgrade: installed samba package post-installation scriptsubprocess returned error exit status 1
Thanks for filing this bug in Ubuntu.
The logs show this error:
invoke-rc.d: initscript smbd, action "start" failed.
[0;1;31m●[0m smbd.service - Samba SMB Daemon
Loaded: loaded (/lib/systemd/system/smbd.service; disabled; vendor preset: enabled)
Active: [0;1;31mfailed[0m (Result: exit-code) since Fri 2018-06-29 15:57:14 PDT; 23ms ago
Docs: man:smbd(8)
man:samba(7)
man:smb.conf(5)
Process: 3681 ExecStart=/usr/sbin/smbd --foreground --no-process-group $SMBDOPTIONS [0;1;31m(code=exited, status=1/FAILURE)[0m
Main PID: 3681 (code=exited, status=1/FAILURE)
Jun 29 15:57:14 avenger.example.com systemd[1]: Starting Samba SMB Daemon...
Jun 29 15:57:14 avenger.example.com systemd[1]: [0;1;39m[0;1;31m[0;1;39msmbd.service: Main process exited, code=exited, status=1/FAILURE[0m
Jun 29 15:57:14 avenger.example.com systemd[1]: [0;1;39m[0;1;31m[0;1;39msmbd.service: Failed with result 'exit-code'.[0m
Jun 29 15:57:14 avenger.example.com systemd[1]: [0;1;31m[0;1;39m[0;1;31mFailed to start Samba SMB Daemon.[0m
dpkg: error processing package samba (--configure):
installed samba package post-installation script subprocess returned error exit status 1
Unfortunately that only confirms that the service failed to start, but
doesn't say why. It's quite likely the cause is a configuration error in
your /etc/samba/smb.conf file.
Please attach /etc/samba/smb.conf to this bug, or at least run the
testparm utility. It will check the file for simple syntax errors.
If that is not enough to highlight the error, then please attach the
samba logs from /var/log/samba/log* to this bug.
Thanks
** Changed in: samba (Ubuntu)
Status: New => Incomplete
--
You received this bug notification because you are subscribed to the bug
report.
https://bugs.launchpad.net/bugs/1779431
Title:
package samba 2:4.7.6+dfsg~ubuntu-0ubuntu2 failed to install/upgrade:
installed samba package post-installation script subprocess returned
error exit status 1
Status in samba package in Ubuntu:
Incomplete
Bug description:
I dont know what the bug is
ProblemType: Package
DistroRelease: Ubuntu 18.04
Package: samba 2:4.7.6+dfsg~ubuntu-0ubuntu2
ProcVersionSignature: Ubuntu 4.15.0-23.25-generic 4.15.18
Uname: Linux 4.15.0-23-generic x86_64
NonfreeKernelModules: pci_stub uvcvideo videobuf2_vmalloc i2400m_usb i2400m videobuf2_memops wimax videobuf2_v4l2 videobuf2_core videodev media dell_laptop dell_smbios_smm dcdbas intel_powerclamp dell_smm_hwmon snd_hda_codec_idt snd_hda_codec_hdmi snd_hda_codec_generic coretemp snd_hda_intel snd_hda_codec snd_hda_core intel_cstate dell_wmi sparse_keymap ir_rc6_decoder iwldvm mac80211 rc_rc6_mce ir_lirc_codec lirc_dev ite_cir iwlwifi rc_core wmi_bmof dell_smbios_wmi dell_smbios dell_wmi_descriptor cfg80211 shpchp lpc_ich i7core_edac mac_hid hid_logitech_hidpp hid_logitech_dj radeon firewire_ohci sdhci_pci firewire_core sdhci wmi
ApportVersion: 2.20.9-0ubuntu7.2
AptOrdering:
samba:amd64: Install
NULL: ConfigurePending
Architecture: amd64
CIFSMounts:
Date: Fri Jun 29 15:57:14 2018
ErrorMessage: installed samba package post-installation script subprocess returned error exit status 1
InstallationDate: Installed on 2018-06-25 (4 days ago)
InstallationMedia: Ubuntu 18.04 LTS "Bionic Beaver" - Release amd64 (20180426)
Python3Details: /usr/bin/python3.6, Python 3.6.5, python3-minimal, 3.6.5-3
PythonDetails: /usr/bin/python2.7, Python 2.7.15rc1, python-minimal, 2.7.15~rc1-1
RelatedPackageVersions:
dpkg 1.19.0.5ubuntu2
apt 1.6.1
SambaClientRegression: Yes
SourcePackage: samba
Title: package samba 2:4.7.6+dfsg~ubuntu-0ubuntu2 failed to install/upgrade: installed samba package post-installation script subprocess returned error exit status 1
UpgradeStatus: No upgrade log present (probably fresh install)
To manage notifications about this bug go to:
https://bugs.launchpad.net/ubuntu/+source/samba/+bug/1779431/+subscriptions
--
You received this bug notification because you are a member of Ubuntu
Foundations Bugs, which is subscribed to samba in Ubuntu.
https://bugs.launchpad.net/bugs/1779431
Title:
package samba 2:4.7.6+dfsg~ubuntu-0ubuntu2 failed to install/upgrade:
installed samba package post-installation script subprocess returned
error exit status 1
Status in samba package in Ubuntu:
Incomplete
Bug description:
I dont know what the bug is
ProblemType: Package
DistroRelease: Ubuntu 18.04
Package: samba 2:4.7.6+dfsg~ubuntu-0ubuntu2
ProcVersionSignature: Ubuntu 4.15.0-23.25-generic 4.15.18
Uname: Linux 4.15.0-23-generic x86_64
NonfreeKernelModules: pci_stub uvcvideo videobuf2_vmalloc i2400m_usb i2400m videobuf2_memops wimax videobuf2_v4l2 videobuf2_core videodev media dell_laptop dell_smbios_smm dcdbas intel_powerclamp dell_smm_hwmon snd_hda_codec_idt snd_hda_codec_hdmi snd_hda_codec_generic coretemp snd_hda_intel snd_hda_codec snd_hda_core intel_cstate dell_wmi sparse_keymap ir_rc6_decoder iwldvm mac80211 rc_rc6_mce ir_lirc_codec lirc_dev ite_cir iwlwifi rc_core wmi_bmof dell_smbios_wmi dell_smbios dell_wmi_descriptor cfg80211 shpchp lpc_ich i7core_edac mac_hid hid_logitech_hidpp hid_logitech_dj radeon firewire_ohci sdhci_pci firewire_core sdhci wmi
ApportVersion: 2.20.9-0ubuntu7.2
AptOrdering:
samba:amd64: Install
NULL: ConfigurePending
Architecture: amd64
CIFSMounts:
Date: Fri Jun 29 15:57:14 2018
ErrorMessage: installed samba package post-installation script subprocess returned error exit status 1
InstallationDate: Installed on 2018-06-25 (4 days ago)
InstallationMedia: Ubuntu 18.04 LTS "Bionic Beaver" - Release amd64 (20180426)
Python3Details: /usr/bin/python3.6, Python 3.6.5, python3-minimal, 3.6.5-3
PythonDetails: /usr/bin/python2.7, Python 2.7.15rc1, python-minimal, 2.7.15~rc1-1
RelatedPackageVersions:
dpkg 1.19.0.5ubuntu2
apt 1.6.1
SambaClientRegression: Yes
SourcePackage: samba
Title: package samba 2:4.7.6+dfsg~ubuntu-0ubuntu2 failed to install/upgrade: installed samba package post-installation script subprocess returned error exit status 1
UpgradeStatus: No upgrade log present (probably fresh install)
To manage notifications about this bug go to:
https://bugs.launchpad.net/ubuntu/+source/samba/+bug/1779431/+subscriptions
More information about the foundations-bugs
mailing list