[Bug 1741865] [NEW] package libblkid1 2.27.1-6ubuntu3.1 failed to install/upgrade: read error in '/var/lib/dpkg/info/libblkid1:amd64.triggers': Input/output error
MANZONI
1741865 at bugs.launchpad.net
Mon Jan 8 09:52:51 UTC 2018
Public bug reported:
package failed to install
ProblemType: Package
DistroRelease: Ubuntu 17.04
Package: libblkid1 2.27.1-6ubuntu3.1
ProcVersionSignature: Ubuntu 4.10.0-42.46-generic 4.10.17
Uname: Linux 4.10.0-42-generic x86_64
ApportVersion: 2.20.4-0ubuntu4.10
AptOrdering:
libblkid1:amd64: Install
libblkid1:amd64: Configure
adobe-flash-properties-gtk:amd64: Install
adobe-flashplugin:amd64: Install
NULL: ConfigurePending
Architecture: amd64
Date: Mon Jan 8 10:47:44 2018
DpkgTerminalLog:
Preparing to unpack .../libblkid1_2.29-1ubuntu2.1_amd64.deb ...
dpkg: error processing archive /var/cache/apt/archives/libblkid1_2.29-1ubuntu2.1_amd64.deb (--unpack):
read error in '/var/lib/dpkg/info/libblkid1:amd64.triggers': Input/output error
DuplicateSignature:
package:libblkid1:2.27.1-6ubuntu3.1
Preparing to unpack .../libblkid1_2.29-1ubuntu2.1_amd64.deb ...
dpkg: error processing archive /var/cache/apt/archives/libblkid1_2.29-1ubuntu2.1_amd64.deb (--unpack):
read error in '/var/lib/dpkg/info/libblkid1:amd64.triggers': Input/output error
ErrorMessage: read error in '/var/lib/dpkg/info/libblkid1:amd64.triggers': Input/output error
InstallationDate: Installed on 2015-01-24 (1079 days ago)
InstallationMedia: Xubuntu 14.04 LTS "Trusty Tahr" - Release amd64 (20140416.2)
RelatedPackageVersions:
dpkg 1.18.10ubuntu2
apt 1.4.6~17.04.1
SourcePackage: util-linux
Title: package libblkid1 2.27.1-6ubuntu3.1 failed to install/upgrade: read error in '/var/lib/dpkg/info/libblkid1:amd64.triggers': Input/output error
UpgradeStatus: No upgrade log present (probably fresh install)
** Affects: util-linux (Ubuntu)
Importance: Undecided
Status: New
** Tags: amd64 apport-package zesty
--
You received this bug notification because you are a member of Ubuntu
Foundations Bugs, which is subscribed to util-linux in Ubuntu.
https://bugs.launchpad.net/bugs/1741865
Title:
package libblkid1 2.27.1-6ubuntu3.1 failed to install/upgrade: read
error in '/var/lib/dpkg/info/libblkid1:amd64.triggers': Input/output
error
Status in util-linux package in Ubuntu:
New
Bug description:
package failed to install
ProblemType: Package
DistroRelease: Ubuntu 17.04
Package: libblkid1 2.27.1-6ubuntu3.1
ProcVersionSignature: Ubuntu 4.10.0-42.46-generic 4.10.17
Uname: Linux 4.10.0-42-generic x86_64
ApportVersion: 2.20.4-0ubuntu4.10
AptOrdering:
libblkid1:amd64: Install
libblkid1:amd64: Configure
adobe-flash-properties-gtk:amd64: Install
adobe-flashplugin:amd64: Install
NULL: ConfigurePending
Architecture: amd64
Date: Mon Jan 8 10:47:44 2018
DpkgTerminalLog:
Preparing to unpack .../libblkid1_2.29-1ubuntu2.1_amd64.deb ...
dpkg: error processing archive /var/cache/apt/archives/libblkid1_2.29-1ubuntu2.1_amd64.deb (--unpack):
read error in '/var/lib/dpkg/info/libblkid1:amd64.triggers': Input/output error
DuplicateSignature:
package:libblkid1:2.27.1-6ubuntu3.1
Preparing to unpack .../libblkid1_2.29-1ubuntu2.1_amd64.deb ...
dpkg: error processing archive /var/cache/apt/archives/libblkid1_2.29-1ubuntu2.1_amd64.deb (--unpack):
read error in '/var/lib/dpkg/info/libblkid1:amd64.triggers': Input/output error
ErrorMessage: read error in '/var/lib/dpkg/info/libblkid1:amd64.triggers': Input/output error
InstallationDate: Installed on 2015-01-24 (1079 days ago)
InstallationMedia: Xubuntu 14.04 LTS "Trusty Tahr" - Release amd64 (20140416.2)
RelatedPackageVersions:
dpkg 1.18.10ubuntu2
apt 1.4.6~17.04.1
SourcePackage: util-linux
Title: package libblkid1 2.27.1-6ubuntu3.1 failed to install/upgrade: read error in '/var/lib/dpkg/info/libblkid1:amd64.triggers': Input/output error
UpgradeStatus: No upgrade log present (probably fresh install)
To manage notifications about this bug go to:
https://bugs.launchpad.net/ubuntu/+source/util-linux/+bug/1741865/+subscriptions
More information about the foundations-bugs
mailing list