[Bug 1748822] [NEW] package python-lazy-object-proxy 1.2.1-1build1 failed to install/upgrade: subprocess installed post-installation script returned error exit status 1
Sumedh Shakya
1748822 at bugs.launchpad.net
Mon Feb 12 05:42:46 UTC 2018
Public bug reported:
dpkg: error processing package pylint (--configure):
dependency problems - leaving unconfigured
Setting up python-egenix-mxtools (3.2.9-1) ...
No apport report written because MaxReports is reached already
No apport report written because MaxReports is reached already
Traceback (most recent call last):
File "/usr/bin/pycompile", line 35, in <module>
from debpython.version import SUPPORTED, debsorted, vrepr, \
File "/usr/share/python/debpython/version.py", line 24, in <module>
from ConfigParser import SafeConfigParser
ImportError: No module named 'ConfigParser'
dpkg: error processing package python-egenix-mxtools (--configure):
subprocess installed post-installation script returned error exit status 1
No apport report written because MaxReports is reached already
dpkg: dependency problems prevent configuration of python-egenix-mxdatetime:
python-egenix-mxdatetime depends on python-egenix-mxtools; however:
Package python-egenix-mxtools is not configured yet.
dpkg: error processing package python-egenix-mxdatetime (--configure):
dependency problems - leaving unconfigured
Setting up software-center-aptdaemon-plugins (0.1.6build1) ...
No apport report written because MaxReports is reached already
Traceback (most recent call last):
File "/usr/bin/pycompile", line 35, in <module>
from debpython.version import SUPPORTED, debsorted, vrepr, \
File "/usr/share/python/debpython/version.py", line 24, in <module>
from ConfigParser import SafeConfigParser
ImportError: No module named 'ConfigParser'
dpkg: error processing package software-center-aptdaemon-plugins (--configure):
subprocess installed post-installation script returned error exit status 1
No apport report written because MaxReports is reached already
dpkg: dependency problems prevent configuration of software-center:
software-center depends on software-center-aptdaemon-plugins; however:
Package software-center-aptdaemon-plugins is not configured yet.
dpkg: error processing package software-center (--configure):
dependency problems - leaving unconfigured
No apport report written because MaxReports is reached already
Errors were encountered while processing:
python-wrapt
python-lazy-object-proxy
python-logilab-common
python-astroid
pylint
python-egenix-mxtools
python-egenix-mxdatetime
software-center-aptdaemon-plugins
software-center
E: Sub-process /usr/bin/dpkg returned an error code (1)
ProblemType: Package
DistroRelease: Ubuntu 16.04
Package: python-lazy-object-proxy 1.2.1-1build1
ProcVersionSignature: Ubuntu 4.4.0-93.116-generic 4.4.79
Uname: Linux 4.4.0-93-generic x86_64
ApportVersion: 2.20.1-0ubuntu2.10
Architecture: amd64
Date: Mon Feb 12 10:38:43 2018
ErrorMessage: subprocess installed post-installation script returned error exit status 1
InstallationDate: Installed on 2017-01-06 (402 days ago)
InstallationMedia: Ubuntu 16.04.1 LTS "Xenial Xerus" - Release amd64 (20160719)
RelatedPackageVersions:
dpkg 1.18.4ubuntu1.2
apt 1.2.20
SourcePackage: lazy-object-proxy
Title: package python-lazy-object-proxy 1.2.1-1build1 failed to install/upgrade: subprocess installed post-installation script returned error exit status 1
UpgradeStatus: No upgrade log present (probably fresh install)
** Affects: lazy-object-proxy (Ubuntu)
Importance: Undecided
Status: New
** Tags: amd64 apport-package third-party-packages xenial
--
You received this bug notification because you are a member of Ubuntu
Foundations Bugs, which is subscribed to lazy-object-proxy in Ubuntu.
https://bugs.launchpad.net/bugs/1748822
Title:
package python-lazy-object-proxy 1.2.1-1build1 failed to
install/upgrade: subprocess installed post-installation script
returned error exit status 1
Status in lazy-object-proxy package in Ubuntu:
New
Bug description:
dpkg: error processing package pylint (--configure):
dependency problems - leaving unconfigured
Setting up python-egenix-mxtools (3.2.9-1) ...
No apport report written because MaxReports is reached already
No apport report written because MaxReports is reached already
Traceback (most recent call last):
File "/usr/bin/pycompile", line 35, in <module>
from debpython.version import SUPPORTED, debsorted, vrepr, \
File "/usr/share/python/debpython/version.py", line 24, in <module>
from ConfigParser import SafeConfigParser
ImportError: No module named 'ConfigParser'
dpkg: error processing package python-egenix-mxtools (--configure):
subprocess installed post-installation script returned error exit status 1
No apport report written because MaxReports is reached already
dpkg: dependency problems prevent configuration of python-egenix-mxdatetime:
python-egenix-mxdatetime depends on python-egenix-mxtools; however:
Package python-egenix-mxtools is not configured yet.
dpkg: error processing package python-egenix-mxdatetime (--configure):
dependency problems - leaving unconfigured
Setting up software-center-aptdaemon-plugins (0.1.6build1) ...
No apport report written because MaxReports is reached already
Traceback (most recent call last):
File "/usr/bin/pycompile", line 35, in <module>
from debpython.version import SUPPORTED, debsorted, vrepr, \
File "/usr/share/python/debpython/version.py", line 24, in <module>
from ConfigParser import SafeConfigParser
ImportError: No module named 'ConfigParser'
dpkg: error processing package software-center-aptdaemon-plugins (--configure):
subprocess installed post-installation script returned error exit status 1
No apport report written because MaxReports is reached already
dpkg: dependency problems prevent configuration of software-center:
software-center depends on software-center-aptdaemon-plugins; however:
Package software-center-aptdaemon-plugins is not configured yet.
dpkg: error processing package software-center (--configure):
dependency problems - leaving unconfigured
No apport report written because MaxReports is reached already
Errors were encountered while processing:
python-wrapt
python-lazy-object-proxy
python-logilab-common
python-astroid
pylint
python-egenix-mxtools
python-egenix-mxdatetime
software-center-aptdaemon-plugins
software-center
E: Sub-process /usr/bin/dpkg returned an error code (1)
ProblemType: Package
DistroRelease: Ubuntu 16.04
Package: python-lazy-object-proxy 1.2.1-1build1
ProcVersionSignature: Ubuntu 4.4.0-93.116-generic 4.4.79
Uname: Linux 4.4.0-93-generic x86_64
ApportVersion: 2.20.1-0ubuntu2.10
Architecture: amd64
Date: Mon Feb 12 10:38:43 2018
ErrorMessage: subprocess installed post-installation script returned error exit status 1
InstallationDate: Installed on 2017-01-06 (402 days ago)
InstallationMedia: Ubuntu 16.04.1 LTS "Xenial Xerus" - Release amd64 (20160719)
RelatedPackageVersions:
dpkg 1.18.4ubuntu1.2
apt 1.2.20
SourcePackage: lazy-object-proxy
Title: package python-lazy-object-proxy 1.2.1-1build1 failed to install/upgrade: subprocess installed post-installation script returned error exit status 1
UpgradeStatus: No upgrade log present (probably fresh install)
To manage notifications about this bug go to:
https://bugs.launchpad.net/ubuntu/+source/lazy-object-proxy/+bug/1748822/+subscriptions
More information about the foundations-bugs
mailing list