[Bug 545790] Re: package PACKAGE failed to install/upgrade: error writing to '<standard output>': Success

brachayehudit brachayehudit at gmail.com
Mon Oct 16 18:45:01 UTC 2017


I had a computer guy do my Ubuntu upgrade to 16 but as you wrote here, he
did not do it well (and I already paid him a generous price for his time).
He warned me he is not so familiar with Ubuntu as with Windows.  So should
I call him back or pay again to have someone who really knows Ubuntu
correct the whole problem.  Would you know someone in Jerusalem Israel who
could be called in or I could bring in my hard disk to him but he should be
recommended by you.  Have a wonderful week and thanks for warning me.
Alice Bracha (my mail is: brachayehudit at gmail.com0

On Fri, Oct 13, 2017 at 6:52 PM, Randyman99 <rgb99 at cox.net> wrote:

> This just happened to me trying to install xsane in Ubuntu 16.04.
> Previous fix seems to be inadequate.
>
> --
> You received this bug notification because you are subscribed to a
> duplicate bug report (1713332).
> https://bugs.launchpad.net/bugs/545790
>
> Title:
>   package PACKAGE failed to install/upgrade: error writing to '<standard
>   output>': Success
>
> Status in dpkg:
>   New
> Status in dpkg package in Ubuntu:
>   Triaged
>
> Bug description:
>   :: DESCRIPTION ::
>   The scenario seems to be:
>   - run update-manager
>   - system crashes / hangs
>   - hard reset
>   - apport triggers this kind of report
>
>   The problem appeared in Karmic
>
>   User experiencing this error are often facing bug 541595 too.
>
>   :: Original description ::
>   upgrade a new install of 9.10 to 10.04 via update-manager -d
>   --
>   previous attempts at 'clean install' from downloaded ISO images for
> Ubuntu 10.04 x64 and i386 failed to boot to media.
>   reinstall of 9.10 followed by update-manager -d caused installer crash (
> and 100% cpu utilization ). reboot resulted in this error.
>   apt-get install -f processed remainder of install.
>   reboot resulted in crashed recycle bin and this error
>
>   ProblemType: Package
>   Architecture: i386
>   Date: Wed Mar 24 01:52:23 2010
>   DistroRelease: Ubuntu 10.04
>   ErrorMessage: error writing to '<standard output>': Success
>   InstallationMedia: Ubuntu 9.10 "Karmic Koala" - Release i386 (20091028.5)
>   NonfreeKernelModules: nvidia
>   Package: libselinux1 2.0.89-4
>   ProcVersionSignature: Ubuntu 2.6.31-14.48-generic
>   SourcePackage: libselinux
>   Title: package libselinux1 2.0.89-4 failed to install/upgrade: error
> writing to '<standard output>': Success
>   Uname: Linux 2.6.31-14-generic i686
>
> To manage notifications about this bug go to:
> https://bugs.launchpad.net/dpkg/+bug/545790/+subscriptions
>

-- 
You received this bug notification because you are a member of Ubuntu
Foundations Bugs, which is subscribed to dpkg in Ubuntu.
https://bugs.launchpad.net/bugs/545790

Title:
  package PACKAGE failed to install/upgrade: error writing to '<standard
  output>': Success

Status in dpkg:
  New
Status in dpkg package in Ubuntu:
  Triaged

Bug description:
  :: DESCRIPTION ::
  The scenario seems to be:
  - run update-manager
  - system crashes / hangs
  - hard reset
  - apport triggers this kind of report

  The problem appeared in Karmic

  User experiencing this error are often facing bug 541595 too.

  :: Original description ::
  upgrade a new install of 9.10 to 10.04 via update-manager -d
  --
  previous attempts at 'clean install' from downloaded ISO images for Ubuntu 10.04 x64 and i386 failed to boot to media.
  reinstall of 9.10 followed by update-manager -d caused installer crash ( and 100% cpu utilization ). reboot resulted in this error.
  apt-get install -f processed remainder of install.
  reboot resulted in crashed recycle bin and this error

  ProblemType: Package
  Architecture: i386
  Date: Wed Mar 24 01:52:23 2010
  DistroRelease: Ubuntu 10.04
  ErrorMessage: error writing to '<standard output>': Success
  InstallationMedia: Ubuntu 9.10 "Karmic Koala" - Release i386 (20091028.5)
  NonfreeKernelModules: nvidia
  Package: libselinux1 2.0.89-4
  ProcVersionSignature: Ubuntu 2.6.31-14.48-generic
  SourcePackage: libselinux
  Title: package libselinux1 2.0.89-4 failed to install/upgrade: error writing to '<standard output>': Success
  Uname: Linux 2.6.31-14-generic i686

To manage notifications about this bug go to:
https://bugs.launchpad.net/dpkg/+bug/545790/+subscriptions



More information about the foundations-bugs mailing list