[Bug 545790] Re: package PACKAGE failed to install/upgrade: error writing to '<standard output>': Success
GFR
robertsgfr at gmail.com
Fri Oct 13 20:34:36 UTC 2017
Thanks for all your great work guys
On Mon, Aug 14, 2017 at 4:35 PM, William Grant <me at williamgrant.id.au>
wrote:
> ** Attachment removed: "C851D2A42CCFEF2D.jpg"
> https://bugs.launchpad.net/ubuntu/+source/dpkg/+bug/
> 545790/+attachment/4922489/+files/C851D2A42CCFEF2D.jpg
>
> --
> You received this bug notification because you are subscribed to a
> duplicate bug report (548780).
> https://bugs.launchpad.net/bugs/545790
>
> Title:
> package PACKAGE failed to install/upgrade: error writing to '<standard
> output>': Success
>
> To manage notifications about this bug go to:
> https://bugs.launchpad.net/dpkg/+bug/545790/+subscriptions
>
--
gfr
--
You received this bug notification because you are a member of Ubuntu
Foundations Bugs, which is subscribed to dpkg in Ubuntu.
https://bugs.launchpad.net/bugs/545790
Title:
package PACKAGE failed to install/upgrade: error writing to '<standard
output>': Success
Status in dpkg:
New
Status in dpkg package in Ubuntu:
Triaged
Bug description:
:: DESCRIPTION ::
The scenario seems to be:
- run update-manager
- system crashes / hangs
- hard reset
- apport triggers this kind of report
The problem appeared in Karmic
User experiencing this error are often facing bug 541595 too.
:: Original description ::
upgrade a new install of 9.10 to 10.04 via update-manager -d
--
previous attempts at 'clean install' from downloaded ISO images for Ubuntu 10.04 x64 and i386 failed to boot to media.
reinstall of 9.10 followed by update-manager -d caused installer crash ( and 100% cpu utilization ). reboot resulted in this error.
apt-get install -f processed remainder of install.
reboot resulted in crashed recycle bin and this error
ProblemType: Package
Architecture: i386
Date: Wed Mar 24 01:52:23 2010
DistroRelease: Ubuntu 10.04
ErrorMessage: error writing to '<standard output>': Success
InstallationMedia: Ubuntu 9.10 "Karmic Koala" - Release i386 (20091028.5)
NonfreeKernelModules: nvidia
Package: libselinux1 2.0.89-4
ProcVersionSignature: Ubuntu 2.6.31-14.48-generic
SourcePackage: libselinux
Title: package libselinux1 2.0.89-4 failed to install/upgrade: error writing to '<standard output>': Success
Uname: Linux 2.6.31-14-generic i686
To manage notifications about this bug go to:
https://bugs.launchpad.net/dpkg/+bug/545790/+subscriptions
More information about the foundations-bugs
mailing list