[Bug 1701681] Re: package grub-efi-amd64-bin 2.02~beta3-4ubuntu2.2 failed to install/upgrade: problèmes de dépendances - laissé non configuré
Mathieu Trudel-Lapierre
mathieu.tl at gmail.com
Tue Jul 25 01:03:47 UTC 2017
Could you please run 'sudo grub-editenv -v /boot/grub/grubenv unset
recordfail' and report here what the result was?
** Changed in: grub2 (Ubuntu)
Status: New => Incomplete
--
You received this bug notification because you are a member of Ubuntu
Foundations Bugs, which is subscribed to grub2 in Ubuntu.
https://bugs.launchpad.net/bugs/1701681
Title:
package grub-efi-amd64-bin 2.02~beta3-4ubuntu2.2 failed to
install/upgrade: problèmes de dépendances - laissé non configuré
Status in grub2 package in Ubuntu:
Incomplete
Bug description:
iovleff at mickey:~$ sudo apt-get install grub-efi-amd64
Reading package lists... Done
Building dependency tree
Reading state information... Done
The following packages were automatically installed and are no longer required:
kde-style-qtcurve kwin-style-qtcurve libkdecorations4abi1 shim
Use 'sudo apt autoremove' to remove them.
The following additional packages will be installed:
grub-common grub-efi-amd64-bin grub2-common os-prober
Suggested packages:
multiboot-doc grub-emu xorriso
The following NEW packages will be installed:
grub-common grub-efi-amd64 grub-efi-amd64-bin grub2-common os-prober
0 upgraded, 5 newly installed, 0 to remove and 0 not upgraded.
Need to get 19,8 kB/3 036 kB of archives.
After this operation, 16,6 MB of additional disk space will be used.
Do you want to continue? [O/n] O
Get:1 http://archive.ubuntu.com/ubuntu zesty/main amd64 os-prober amd64 1.74ubuntu1 [19,8 kB]
Fetched 19,8 kB in 0s (112 kB/s)
Preconfiguring packages ...
Selecting previously unselected package grub-common.
(Reading database ... 381963 files and directories currently installed.)
Preparing to unpack .../grub-common_2.02~beta3-4ubuntu2.2_amd64.deb ...
Unpacking grub-common (2.02~beta3-4ubuntu2.2) ...
Selecting previously unselected package grub2-common.
Preparing to unpack .../grub2-common_2.02~beta3-4ubuntu2.2_amd64.deb ...
Unpacking grub2-common (2.02~beta3-4ubuntu2.2) ...
Selecting previously unselected package grub-efi-amd64-bin.
Preparing to unpack .../grub-efi-amd64-bin_2.02~beta3-4ubuntu2.2_amd64.deb ...
Unpacking grub-efi-amd64-bin (2.02~beta3-4ubuntu2.2) ...
Selecting previously unselected package grub-efi-amd64.
Preparing to unpack .../grub-efi-amd64_2.02~beta3-4ubuntu2.2_amd64.deb ...
Unpacking grub-efi-amd64 (2.02~beta3-4ubuntu2.2) ...
Selecting previously unselected package os-prober.
Preparing to unpack .../os-prober_1.74ubuntu1_amd64.deb ...
Unpacking os-prober (1.74ubuntu1) ...
Processing triggers for ureadahead (0.100.0-19) ...
Processing triggers for install-info (6.3.0.dfsg.1-1) ...
Setting up grub-common (2.02~beta3-4ubuntu2.2) ...
update-rc.d: warning: start and stop actions are no longer supported; falling back to defaults
Job for grub-common.service failed because a timeout was exceeded.
See "systemctl status grub-common.service" and "journalctl -xe" for details.
invoke-rc.d: initscript grub-common, action "start" failed.
● grub-common.service - LSB: Record successful boot for GRUB
Loaded: loaded (/etc/init.d/grub-common; generated; vendor preset: enabled)
Active: failed (Result: timeout) since Fri 2017-06-30 17:52:02 CEST; 10ms ago
Docs: man:systemd-sysv-generator(8)
Process: 7365 ExecStart=/etc/init.d/grub-common start (code=killed, signal=TERM)
Tasks: 3 (limit: 4915)
CGroup: /system.slice/grub-common.service
├─6172 plymouth --ping
└─7369 plymouth --ping
juin 30 17:47:02 mickey systemd[1]: Starting LSB: Record successful boot for GRUB...
juin 30 17:52:02 mickey systemd[1]: grub-common.service: Start operation timed out. Terminating.
juin 30 17:52:02 mickey systemd[1]: Failed to start LSB: Record successful boot for GRUB.
juin 30 17:52:02 mickey systemd[1]: grub-common.service: Unit entered failed state.
juin 30 17:52:02 mickey systemd[1]: grub-common.service: Failed with result 'timeout'.
dpkg: error processing package grub-common (--configure):
subprocess installed post-installation script returned error exit status 1
Processing triggers for systemd (232-21ubuntu5) ...
Processing triggers for man-db (2.7.6.1-2) ...
dpkg: dependency problems prevent configuration of grub-efi-amd64-bin:
grub-efi-amd64-bin depends on grub-common (= 2.02~beta3-4ubuntu2.2); however:
Package grub-common is not configured yet.
dpkg: error processing package grub-efi-amd64-bin (--configure):
dependency problems - leaving unconfigured
dpkg: dependency problems prevent configuration of grub-efi-amd64:
grub-efi-amd64 depends on grub-common (= 2.02~beta3-4ubuntu2.2); however:
Package grub-common is not configured yet.
grub-efi-amd64 depends on grub-efi-amd64-bin (= 2.02~beta3-4ubuntu2.2); however:
Package grub-efi-amd64-bin is not configured yet.
dpkg: error processing package grub-efi-amd64 (--configure):
dependency problems - leaving unconfigured
No apport report written because the error message indicates its a followup error from a previous failure.
No apport report written because the error message indicates its a followup error from a previous failure.
No apport report written because MaxReports is reached already
No apport report written because MaxReports is reached already
dpkg: dependency problems prevent configuration of grub2-common:
grub2-common depends on grub-common (= 2.02~beta3-4ubuntu2.2); however:
Package grub-common is not configured yet.
dpkg: error processing package grub2-common (--configure):
dependency problems - leaving unconfigured
dpkg: dependency problems prevent configuration of os-prober:
os-prober depends on grub-common; however:
Package grub-common is not configured yet.
dpkg: error processing package os-prober (--configure):
dependency problems - leaving unconfigured
Errors were encountered while processing:
grub-common
grub-efi-amd64-bin
grub-efi-amd64
grub2-common
os-prober
E: Sub-process /usr/bin/dpkg returned an error code (1)
W: Operation was interrupted before it could finish
ProblemType: Package
DistroRelease: Ubuntu 17.04
Package: grub-efi-amd64-bin 2.02~beta3-4ubuntu2.2
ProcVersionSignature: Ubuntu 4.10.0-19.21-generic 4.10.8
Uname: Linux 4.10.0-19-generic x86_64
ApportVersion: 2.20.4-0ubuntu4.3
Architecture: amd64
Date: Fri Jun 30 02:21:25 2017
ErrorMessage: problèmes de dépendances - laissé non configuré
InstallationDate: Installed on 2017-06-26 (4 days ago)
InstallationMedia: Ubuntu-GNOME 17.04 "Zesty Zapus" - Release amd64 (20170412)
ProcCmdLine: BOOT_IMAGE=/boot/vmlinuz-4.10.0-19-generic.efi.signed root=/dev/mapper/ubuntu--gnome--vg-root ro quiet splash vt.handoff=7
RelatedPackageVersions:
dpkg 1.18.10ubuntu2
apt 1.4
SourcePackage: grub2
Title: package grub-efi-amd64-bin 2.02~beta3-4ubuntu2.2 failed to install/upgrade: problèmes de dépendances - laissé non configuré
UpgradeStatus: No upgrade log present (probably fresh install)
To manage notifications about this bug go to:
https://bugs.launchpad.net/ubuntu/+source/grub2/+bug/1701681/+subscriptions
More information about the foundations-bugs
mailing list