[Bug 1659984] [NEW] package grub-efi-amd64-signed 1.66.7+2.02~beta2-36ubuntu3.7 failed to install/upgrade: subprocess installed post-installation script returned error exit status 1
sami almoeehi
sami.almoeehi at gmail.com
Fri Jan 27 23:37:49 UTC 2017
Public bug reported:
have error with update
ProblemType: Package
DistroRelease: Ubuntu 16.04
Package: grub-efi-amd64-signed 1.66.7+2.02~beta2-36ubuntu3.7
ProcVersionSignature: Ubuntu 4.4.0-51.72-generic 4.4.30
Uname: Linux 4.4.0-51-generic x86_64
ApportVersion: 2.20.1-0ubuntu2.5
Architecture: amd64
Date: Fri Jan 27 03:28:42 2017
DuplicateSignature:
package:grub-efi-amd64-signed:1.66.7+2.02~beta2-36ubuntu3.7
Setting up grub-efi-amd64-signed (1.66.7+2.02~beta2-36ubuntu3.7) ...
grub-install: error: /usr/lib/grub/i386-pc/modinfo.sh doesn't exist. Please specify --target or --directory.
dpkg: error processing package grub-efi-amd64-signed (--configure):
subprocess installed post-installation script returned error exit status 1
ErrorMessage: subprocess installed post-installation script returned error exit status 1
InstallationDate: Installed on 2016-02-01 (361 days ago)
InstallationMedia: It
RelatedPackageVersions:
dpkg 1.18.4ubuntu1.1
apt 1.2.19
SourcePackage: grub2-signed
Title: package grub-efi-amd64-signed 1.66.7+2.02~beta2-36ubuntu3.7 failed to install/upgrade: subprocess installed post-installation script returned error exit status 1
UpgradeStatus: Upgraded to xenial on 2016-04-24 (278 days ago)
** Affects: grub2-signed (Ubuntu)
Importance: Undecided
Status: New
** Tags: amd64 apport-package xenial
--
You received this bug notification because you are a member of Ubuntu
Foundations Bugs, which is subscribed to grub2-signed in Ubuntu.
https://bugs.launchpad.net/bugs/1659984
Title:
package grub-efi-amd64-signed 1.66.7+2.02~beta2-36ubuntu3.7 failed to
install/upgrade: subprocess installed post-installation script
returned error exit status 1
Status in grub2-signed package in Ubuntu:
New
Bug description:
have error with update
ProblemType: Package
DistroRelease: Ubuntu 16.04
Package: grub-efi-amd64-signed 1.66.7+2.02~beta2-36ubuntu3.7
ProcVersionSignature: Ubuntu 4.4.0-51.72-generic 4.4.30
Uname: Linux 4.4.0-51-generic x86_64
ApportVersion: 2.20.1-0ubuntu2.5
Architecture: amd64
Date: Fri Jan 27 03:28:42 2017
DuplicateSignature:
package:grub-efi-amd64-signed:1.66.7+2.02~beta2-36ubuntu3.7
Setting up grub-efi-amd64-signed (1.66.7+2.02~beta2-36ubuntu3.7) ...
grub-install: error: /usr/lib/grub/i386-pc/modinfo.sh doesn't exist. Please specify --target or --directory.
dpkg: error processing package grub-efi-amd64-signed (--configure):
subprocess installed post-installation script returned error exit status 1
ErrorMessage: subprocess installed post-installation script returned error exit status 1
InstallationDate: Installed on 2016-02-01 (361 days ago)
InstallationMedia: It
RelatedPackageVersions:
dpkg 1.18.4ubuntu1.1
apt 1.2.19
SourcePackage: grub2-signed
Title: package grub-efi-amd64-signed 1.66.7+2.02~beta2-36ubuntu3.7 failed to install/upgrade: subprocess installed post-installation script returned error exit status 1
UpgradeStatus: Upgraded to xenial on 2016-04-24 (278 days ago)
To manage notifications about this bug go to:
https://bugs.launchpad.net/ubuntu/+source/grub2-signed/+bug/1659984/+subscriptions
More information about the foundations-bugs
mailing list