[Bug 1569434] Re: adt-run fails with "dpkg-genchanges: error: cannot read ../akonadi_15.12.1-0ubuntu4.dsc: No such file or directory"

Rik Mills rik.mills88 at gmail.com
Sat Jan 21 00:05:59 UTC 2017


Just ran into this.

autopkgtest kde-runtime_16.12.1-0ubuntu1.dsc -- qemu autopkgtest-zesty-
amd64.img

fails with

dh_builddeb -u-Zxz  
dpkg-deb: building package 'kde-runtime' in '../kde-runtime_16.12.1-0ubuntu1_amd64.deb'.
dpkg-deb: building package 'kdebase-runtime' in '../kdebase-runtime_16.12.1-0ubuntu1_all.deb'.
dpkg-deb: building package 'kde-runtime-data' in '../kde-runtime-data_16.12.1-0ubuntu1_all.deb'.
dpkg-deb: building package 'plasma-scriptengine-javascript' in '../plasma-scriptengine-javascript_16.12.1-0ubuntu1_amd64.deb'.
=== Start list-missing
=== End list-missing
dpkg-genchanges > ../.pkg-kde-lintian.changes
dpkg-genchanges: error: cannot read ../kde-runtime_16.12.1-0ubuntu1.dsc: No such file or directory
/usr/share/pkg-kde-tools/qt-kde-team/2/lintian.mk:20: recipe for target 'lintian' failed
make[1]: *** [lintian] Error 2
make[1]: Leaving directory '/tmp/autopkgtest.RcZr7G/build.KDu/kde-runtime-16.12.1'
/usr/share/pkg-kde-tools/qt-kde-team/2/dhmk.mk:110: recipe for target 'debian/dhmk_binary' failed
make: *** [debian/dhmk_binary] Error 2
dpkg-buildpackage: error: fakeroot debian/rules binary gave error exit status 2
blame: kde-runtime_16.12.1-0ubuntu1.dsc
badpkg: rules build failed with exit code 2
autopkgtest [00:03:13]: ERROR: erroneous package: rules build failed with exit code 2
qemu-system-x86_64: terminating on signal 15 from pid 15060

** Changed in: autopkgtest (Ubuntu)
       Status: Expired => Confirmed

-- 
You received this bug notification because you are a member of Ubuntu
Foundations Bugs, which is subscribed to autopkgtest in Ubuntu.
https://bugs.launchpad.net/bugs/1569434

Title:
  adt-run fails with "dpkg-genchanges: error: cannot read
  ../akonadi_15.12.1-0ubuntu4.dsc: No such file or directory"

Status in autopkgtest package in Ubuntu:
  Confirmed

Bug description:
  Steps to reproduce:

  Install autopkgtest 3.20.3 on Xenial.
  adt-buildvm-ubuntu-cloud -r xenial
  pull-lp-source -d akonadi
  adt-run -oadt --apt-pocket=proposed -U akonadi_15.12.1-0ubuntu3.dsc --- adt-virt-qemu ~/adt-xenial-amd64-cloud.img

  Note: I used ubuntu4 since that is my proposed upload. My change is
  just to do s/5.6/5.7/ in debian/control, so I think that is unrelated
  to this issue.

  The error was:

  dpkg-deb: building package 'akonadi-backend-sqlite' in '../akonadi-backend-sqlite_15.12.1-0ubuntu4_amd64.deb'.
  dpkg-deb: building package 'akonadi-dbg' in '../akonadi-dbg_15.12.1-0ubuntu4_amd64.deb'.
  === Start list-missing
  === End list-missing
  dpkg-genchanges > ../.pkg-kde-lintian.changes
  dpkg-genchanges: error: cannot read ../akonadi_15.12.1-0ubuntu4.dsc: No such file or directory
  /usr/share/pkg-kde-tools/qt-kde-team/3/lintian.mk:20: recipe for target 'lintian' failed
  make[1]: *** [lintian] Error 2
  make[1]: Leaving directory '/tmp/adt-run.rhiFtm/build.N6U/akonadi-15.12.1'
  /usr/share/pkg-kde-tools/qt-kde-team/3/dhmk.mk:112: recipe for target 'debian/dhmk_binary' failed
  make: *** [debian/dhmk_binary] Error 2
  dpkg-buildpackage: error: fakeroot debian/rules binary gave error exit status 2
  blame: akonadi_15.12.1-0ubuntu4.dsc
  badpkg: rules build failed with exit code 2
  adt-run [15:48:08]: ERROR: erroneous package: rules build failed with exit code 2
  qemu-system-x86_64: terminating on signal 15 from pid 7829

  Full log at: http://paste.ubuntu.com/15794227/

To manage notifications about this bug go to:
https://bugs.launchpad.net/ubuntu/+source/autopkgtest/+bug/1569434/+subscriptions



More information about the foundations-bugs mailing list