[Bug 1713501] [NEW] package grub-efi-amd64-signed 1.66.12+2.02~beta2-36ubuntu3.12 failed to install/upgrade: subprocess installed post-installation script returned error exit status 1

Anil anil.parul at gmail.com
Mon Aug 28 13:23:33 UTC 2017


Public bug reported:

not working

ProblemType: Package
DistroRelease: Ubuntu 16.04
Package: grub-efi-amd64-signed 1.66.12+2.02~beta2-36ubuntu3.12
ProcVersionSignature: Ubuntu 4.4.0-31.50-generic 4.4.13
Uname: Linux 4.4.0-31-generic x86_64
ApportVersion: 2.20.1-0ubuntu2.1
Architecture: amd64
Date: Mon Aug 28 13:25:32 2017
DuplicateSignature:
 package:grub-efi-amd64-signed:1.66.12+2.02~beta2-36ubuntu3.12
 Setting up grub-efi-amd64-signed (1.66.1+2.02~beta2-36ubuntu3.1) ...
 grub-install: error: /usr/lib/grub/i386-pc/modinfo.sh doesn't exist. Please specify --target or --directory.
 dpkg: error processing package grub-efi-amd64-signed (--configure):
  subprocess installed post-installation script returned error exit status 1
ErrorMessage: subprocess installed post-installation script returned error exit status 1
RelatedPackageVersions:
 dpkg 1.18.4ubuntu1.2
 apt  1.2.12~ubuntu16.04.1
SourcePackage: grub2-signed
Title: package grub-efi-amd64-signed 1.66.12+2.02~beta2-36ubuntu3.12 failed to install/upgrade: subprocess installed post-installation script returned error exit status 1
UpgradeStatus: No upgrade log present (probably fresh install)

** Affects: grub2-signed (Ubuntu)
     Importance: Undecided
         Status: New


** Tags: amd64 apport-package xenial

-- 
You received this bug notification because you are a member of Ubuntu
Foundations Bugs, which is subscribed to grub2-signed in Ubuntu.
https://bugs.launchpad.net/bugs/1713501

Title:
  package grub-efi-amd64-signed 1.66.12+2.02~beta2-36ubuntu3.12 failed
  to install/upgrade: subprocess installed post-installation script
  returned error exit status 1

Status in grub2-signed package in Ubuntu:
  New

Bug description:
  not working

  ProblemType: Package
  DistroRelease: Ubuntu 16.04
  Package: grub-efi-amd64-signed 1.66.12+2.02~beta2-36ubuntu3.12
  ProcVersionSignature: Ubuntu 4.4.0-31.50-generic 4.4.13
  Uname: Linux 4.4.0-31-generic x86_64
  ApportVersion: 2.20.1-0ubuntu2.1
  Architecture: amd64
  Date: Mon Aug 28 13:25:32 2017
  DuplicateSignature:
   package:grub-efi-amd64-signed:1.66.12+2.02~beta2-36ubuntu3.12
   Setting up grub-efi-amd64-signed (1.66.1+2.02~beta2-36ubuntu3.1) ...
   grub-install: error: /usr/lib/grub/i386-pc/modinfo.sh doesn't exist. Please specify --target or --directory.
   dpkg: error processing package grub-efi-amd64-signed (--configure):
    subprocess installed post-installation script returned error exit status 1
  ErrorMessage: subprocess installed post-installation script returned error exit status 1
  RelatedPackageVersions:
   dpkg 1.18.4ubuntu1.2
   apt  1.2.12~ubuntu16.04.1
  SourcePackage: grub2-signed
  Title: package grub-efi-amd64-signed 1.66.12+2.02~beta2-36ubuntu3.12 failed to install/upgrade: subprocess installed post-installation script returned error exit status 1
  UpgradeStatus: No upgrade log present (probably fresh install)

To manage notifications about this bug go to:
https://bugs.launchpad.net/ubuntu/+source/grub2-signed/+bug/1713501/+subscriptions



More information about the foundations-bugs mailing list