[Bug 1681877] [NEW] package grub-pc 2.02~beta2-36ubuntu3.9 failed to install/upgrade: subprocess installed post-installation script returned error exit status 1

Yang Ice Ender Dragneel 1681877 at bugs.launchpad.net
Tue Apr 11 16:02:15 UTC 2017


Public bug reported:

i'm not sure what happened . i accidentally shut down my laptop while i
was installing the new version of kubuntu, and after i managed to fix my
lap and continue updating this bug showed up

ProblemType: Package
DistroRelease: Ubuntu 16.04
Package: grub-pc 2.02~beta2-36ubuntu3.9
ProcVersionSignature: Ubuntu 3.13.0-116.163-generic 3.13.11-ckt39
Uname: Linux 3.13.0-116-generic i686
ApportVersion: 2.20.1-0ubuntu2.5
Architecture: i386
Date: Tue Apr 11 18:47:02 2017
DuplicateSignature:
 package:grub-pc:2.02~beta2-36ubuntu3.9
 Setting up grub-pc (2.02~beta2-36ubuntu3.9) ...
 cp: error reading '/usr/share/grub/unicode.pf2': Input/output error
 dpkg: error processing package grub-pc (--configure):
  subprocess installed post-installation script returned error exit status 1
ErrorMessage: subprocess installed post-installation script returned error exit status 1
InstallationDate: Installed on 2017-03-30 (11 days ago)
InstallationMedia: Ubuntu 13.10 "Saucy Salamander" - Release i386 (20131016.1)
ProcCmdLine: BOOT_IMAGE=/boot/vmlinuz-3.13.0-116-generic root=UUID=d4dbd8ca-07a9-4a17-a34d-7c7da06947fa ro quiet splash vt.handoff=7
RelatedPackageVersions:
 dpkg 1.18.4ubuntu1.2
 apt  1.2.20
SourcePackage: grub2
Title: package grub-pc 2.02~beta2-36ubuntu3.9 failed to install/upgrade: subprocess installed post-installation script returned error exit status 1
UpgradeStatus: Upgraded to xenial on 2017-04-11 (0 days ago)

** Affects: grub2 (Ubuntu)
     Importance: Undecided
         Status: New


** Tags: apport-package i386 xenial

-- 
You received this bug notification because you are a member of Ubuntu
Foundations Bugs, which is subscribed to grub2 in Ubuntu.
https://bugs.launchpad.net/bugs/1681877

Title:
  package grub-pc 2.02~beta2-36ubuntu3.9 failed to install/upgrade:
  subprocess installed post-installation script returned error exit
  status 1

Status in grub2 package in Ubuntu:
  New

Bug description:
  i'm not sure what happened . i accidentally shut down my laptop while
  i was installing the new version of kubuntu, and after i managed to
  fix my lap and continue updating this bug showed up

  ProblemType: Package
  DistroRelease: Ubuntu 16.04
  Package: grub-pc 2.02~beta2-36ubuntu3.9
  ProcVersionSignature: Ubuntu 3.13.0-116.163-generic 3.13.11-ckt39
  Uname: Linux 3.13.0-116-generic i686
  ApportVersion: 2.20.1-0ubuntu2.5
  Architecture: i386
  Date: Tue Apr 11 18:47:02 2017
  DuplicateSignature:
   package:grub-pc:2.02~beta2-36ubuntu3.9
   Setting up grub-pc (2.02~beta2-36ubuntu3.9) ...
   cp: error reading '/usr/share/grub/unicode.pf2': Input/output error
   dpkg: error processing package grub-pc (--configure):
    subprocess installed post-installation script returned error exit status 1
  ErrorMessage: subprocess installed post-installation script returned error exit status 1
  InstallationDate: Installed on 2017-03-30 (11 days ago)
  InstallationMedia: Ubuntu 13.10 "Saucy Salamander" - Release i386 (20131016.1)
  ProcCmdLine: BOOT_IMAGE=/boot/vmlinuz-3.13.0-116-generic root=UUID=d4dbd8ca-07a9-4a17-a34d-7c7da06947fa ro quiet splash vt.handoff=7
  RelatedPackageVersions:
   dpkg 1.18.4ubuntu1.2
   apt  1.2.20
  SourcePackage: grub2
  Title: package grub-pc 2.02~beta2-36ubuntu3.9 failed to install/upgrade: subprocess installed post-installation script returned error exit status 1
  UpgradeStatus: Upgraded to xenial on 2017-04-11 (0 days ago)

To manage notifications about this bug go to:
https://bugs.launchpad.net/ubuntu/+source/grub2/+bug/1681877/+subscriptions



More information about the foundations-bugs mailing list