[Bug 1591682] [NEW] package linux-image-4.2.0-38-generic 4.2.0-38.45~14.04.1 failed to install/upgrade: run-parts: /etc/kernel/postinst.d/zz-update-grub exited with return code 127

Afaf afaf.taik at outlook.fr
Sun Jun 12 12:06:10 UTC 2016


Public bug reported:

dpkg: error processing package linux-generic-lts-wily (--configure):
 dependency problems - leaving unconfigured
dpkg: dependency problems prevent configuration of linux-image-extra-4.2.0-36-generic:
 linux-image-extra-4.2.0-36-generic depends on linux-image-4.2.0-36-generic; however:
  Package linux-image-4.2.0-36-generic is not configured yet.

dpkg: error processing package linux-image-extra-4.2.0-36-generic (--configure):
 dependency problems - leaving unconfigured
Errors were encountered while processing:
 linux-image-4.2.0-36-generic
 linux-image-4.2.0-38-generic
 linux-image-extra-4.2.0-38-generic
 linux-image-generic-lts-wily
 linux-generic-lts-wily
 linux-image-extra-4.2.0-36-generic
E: Sub-process /usr/bin/dpkg returned an error code (1)


whenever I try installing something this occures

ProblemType: Package
DistroRelease: Ubuntu 14.04
Package: linux-image-4.2.0-38-generic 4.2.0-38.45~14.04.1
ProcVersionSignature: Ubuntu 4.2.0-35.40~14.04.1-generic 4.2.8-ckt5
Uname: Linux 4.2.0-35-generic x86_64
ApportVersion: 2.14.1-0ubuntu3.21
Architecture: amd64
Date: Sat Jun 11 18:05:58 2016
DuplicateSignature: package:linux-image-4.2.0-38-generic:4.2.0-38.45~14.04.1:run-parts: /etc/kernel/postinst.d/zz-update-grub exited with return code 127
ErrorMessage: run-parts: /etc/kernel/postinst.d/zz-update-grub exited with return code 127
InstallationDate: Installed on 2016-04-13 (58 days ago)
InstallationMedia: Ubuntu 14.04.4 LTS "Trusty Tahr" - Release amd64 (20160217.1)
RelatedPackageVersions:
 dpkg 1.17.5ubuntu5.6
 apt  1.0.1ubuntu2.14
SourcePackage: grub
Title: package linux-image-4.2.0-38-generic 4.2.0-38.45~14.04.1 failed to install/upgrade: run-parts: /etc/kernel/postinst.d/zz-update-grub exited with return code 127
UpgradeStatus: No upgrade log present (probably fresh install)

** Affects: grub (Ubuntu)
     Importance: Undecided
         Status: New


** Tags: amd64 apport-package need-duplicate-check trusty

-- 
You received this bug notification because you are a member of Ubuntu
Foundations Bugs, which is subscribed to grub in Ubuntu.
https://bugs.launchpad.net/bugs/1591682

Title:
  package linux-image-4.2.0-38-generic 4.2.0-38.45~14.04.1 failed to
  install/upgrade: run-parts: /etc/kernel/postinst.d/zz-update-grub
  exited with return code 127

Status in grub package in Ubuntu:
  New

Bug description:
  dpkg: error processing package linux-generic-lts-wily (--configure):
   dependency problems - leaving unconfigured
  dpkg: dependency problems prevent configuration of linux-image-extra-4.2.0-36-generic:
   linux-image-extra-4.2.0-36-generic depends on linux-image-4.2.0-36-generic; however:
    Package linux-image-4.2.0-36-generic is not configured yet.

  dpkg: error processing package linux-image-extra-4.2.0-36-generic (--configure):
   dependency problems - leaving unconfigured
  Errors were encountered while processing:
   linux-image-4.2.0-36-generic
   linux-image-4.2.0-38-generic
   linux-image-extra-4.2.0-38-generic
   linux-image-generic-lts-wily
   linux-generic-lts-wily
   linux-image-extra-4.2.0-36-generic
  E: Sub-process /usr/bin/dpkg returned an error code (1)

  
  whenever I try installing something this occures

  ProblemType: Package
  DistroRelease: Ubuntu 14.04
  Package: linux-image-4.2.0-38-generic 4.2.0-38.45~14.04.1
  ProcVersionSignature: Ubuntu 4.2.0-35.40~14.04.1-generic 4.2.8-ckt5
  Uname: Linux 4.2.0-35-generic x86_64
  ApportVersion: 2.14.1-0ubuntu3.21
  Architecture: amd64
  Date: Sat Jun 11 18:05:58 2016
  DuplicateSignature: package:linux-image-4.2.0-38-generic:4.2.0-38.45~14.04.1:run-parts: /etc/kernel/postinst.d/zz-update-grub exited with return code 127
  ErrorMessage: run-parts: /etc/kernel/postinst.d/zz-update-grub exited with return code 127
  InstallationDate: Installed on 2016-04-13 (58 days ago)
  InstallationMedia: Ubuntu 14.04.4 LTS "Trusty Tahr" - Release amd64 (20160217.1)
  RelatedPackageVersions:
   dpkg 1.17.5ubuntu5.6
   apt  1.0.1ubuntu2.14
  SourcePackage: grub
  Title: package linux-image-4.2.0-38-generic 4.2.0-38.45~14.04.1 failed to install/upgrade: run-parts: /etc/kernel/postinst.d/zz-update-grub exited with return code 127
  UpgradeStatus: No upgrade log present (probably fresh install)

To manage notifications about this bug go to:
https://bugs.launchpad.net/ubuntu/+source/grub/+bug/1591682/+subscriptions



More information about the foundations-bugs mailing list