[Bug 1600430] [NEW] package libboost-filesystem1.58.0 1.58.0+dfsg-5ubuntu3 failed to install/upgrade: el subproceso dpkg-deb --control devolvió el código de salida de error 2
angel
angel_j_g_ at hotmail.com
Sat Jul 9 06:28:08 UTC 2016
Public bug reported:
xxxxx at xxxxxx:~$ sudo apt-get update && sudo apt-get dist-upgrade -y
[sudo] password for xxxxx:
Lo sentimos, vuelva a intentarlo.
[sudo] password for xxxxx:
Obj:1 http://ppa.launchpad.net/atareao/atareao/ubuntu xenial InRelease
Obj:2 http://archive.canonical.com/ubuntu xenial InRelease
Des:3 http://security.ubuntu.com/ubuntu xenial-security InRelease [94.5 kB]
Obj:4 http://mx.archive.ubuntu.com/ubuntu xenial InRelease
Obj:6 http://ppa.launchpad.net/atareao/telegram/ubuntu xenial InRelease
Obj:7 http://repository.spotify.com stable InRelease
Des:8 http://mx.archive.ubuntu.com/ubuntu xenial-updates InRelease [94.5 kB]
Obj:9 http://ppa.launchpad.net/clipgrab-team/ppa/ubuntu xenial InRelease
Obj:10 http://ppa.launchpad.net/gezakovacs/ppa/ubuntu xenial InRelease
Obj:5 http://screenshots.getdeb.net xenial-getdeb InRelease
Obj:11 http://ppa.launchpad.net/indicator-brightness/ppa/ubuntu xenial InRelease
Des:12 http://mx.archive.ubuntu.com/ubuntu xenial-backports InRelease [92.2 kB]
Obj:13 http://ppa.launchpad.net/moka/stable/ubuntu xenial InRelease
Obj:14 http://ppa.launchpad.net/nemh/systemback/ubuntu xenial InRelease
Obj:15 http://ppa.launchpad.net/nilarimogard/webupd8/ubuntu xenial InRelease
Obj:16 http://ppa.launchpad.net/noobslab/macbuntu/ubuntu xenial InRelease
Obj:17 http://ppa.launchpad.net/numix/ppa/ubuntu xenial InRelease
Obj:18 http://ppa.launchpad.net/otto-kesselgulasch/gimp/ubuntu xenial InRelease
Des:19 https://deb.opera.com/opera-developer stable InRelease [2 592 B]
Des:20 http://security.ubuntu.com/ubuntu xenial-security/main amd64 Packages [117 kB]
Obj:21 http://ppa.launchpad.net/pulb/mailnag/ubuntu xenial InRelease
Des:22 https://deb.opera.com/opera-stable stable InRelease [2 592 B]
Obj:23 http://ppa.launchpad.net/tails-team/tails-installer/ubuntu xenial InRelease
Des:24 http://mx.archive.ubuntu.com/ubuntu xenial-updates/main amd64 Packages [248 kB]
Des:25 http://ppa.launchpad.net/varlesh-l/papirus-pack/ubuntu xenial InRelease [18.1 kB]
Des:26 http://security.ubuntu.com/ubuntu xenial-security/main i386 Packages [114 kB]
Obj:27 http://ppa.launchpad.net/webupd8team/java/ubuntu xenial InRelease
Des:28 http://security.ubuntu.com/ubuntu xenial-security/main Translation-en [44.8 kB]
Des:29 http://security.ubuntu.com/ubuntu xenial-security/main amd64 DEP-11 Metadata [44.0 kB]
Des:30 http://security.ubuntu.com/ubuntu xenial-security/main DEP-11 64x64 Icons [50.8 kB]
Des:31 http://security.ubuntu.com/ubuntu xenial-security/universe amd64 Packages [33.2 kB]
Des:32 https://deb.opera.com/opera-developer stable/non-free amd64 Packages [1 813 B]
Des:33 https://deb.opera.com/opera-developer stable/non-free i386 Packages [1 821 B]
Des:34 https://deb.opera.com/opera-stable stable/non-free amd64 Packages [1 813 B]
Des:35 http://mx.archive.ubuntu.com/ubuntu xenial-updates/main i386 Packages [244 kB]
Des:36 http://ppa.launchpad.net/varlesh-l/papirus-pack/ubuntu xenial/main amd64 Packages [1 964 B]
Des:37 https://deb.opera.com/opera-stable stable/non-free i386 Packages [1 821 B]
Des:38 http://security.ubuntu.com/ubuntu xenial-security/universe i386 Packages [33.2 kB]
Des:39 http://ppa.launchpad.net/varlesh-l/papirus-pack/ubuntu xenial/main i386 Packages [1 964 B]
Des:40 http://security.ubuntu.com/ubuntu xenial-security/universe Translation-en [19.9 kB]
Des:41 http://security.ubuntu.com/ubuntu xenial-security/universe amd64 DEP-11 Metadata [2 327 B]
Des:42 http://mx.archive.ubuntu.com/ubuntu xenial-updates/main Translation-en [98.1 kB]
Des:43 http://mx.archive.ubuntu.com/ubuntu xenial-updates/universe amd64 Packages [152 kB]
Des:44 http://mx.archive.ubuntu.com/ubuntu xenial-updates/universe i386 Packages [149 kB]
Des:45 http://mx.archive.ubuntu.com/ubuntu xenial-updates/universe Translation-en [74.9 kB]
Des:46 http://mx.archive.ubuntu.com/ubuntu xenial-updates/universe amd64 DEP-11 Metadata [69.3 kB]
Des:47 http://mx.archive.ubuntu.com/ubuntu xenial-updates/universe DEP-11 64x64 Icons [71.0 kB]
Des:48 http://mx.archive.ubuntu.com/ubuntu xenial-backports/main amd64 Packages [676 B]
Des:49 http://mx.archive.ubuntu.com/ubuntu xenial-backports/main i386 Packages [676 B]
Des:50 http://mx.archive.ubuntu.com/ubuntu xenial-backports/main Translation-en [524 B]
Des:51 http://mx.archive.ubuntu.com/ubuntu xenial-backports/main amd64 DEP-11 Metadata [197 B]
Des:52 http://mx.archive.ubuntu.com/ubuntu xenial-backports/universe amd64 Packages [608 B]
Des:53 http://mx.archive.ubuntu.com/ubuntu xenial-backports/universe i386 Packages [612 B]
Des:54 http://mx.archive.ubuntu.com/ubuntu xenial-backports/universe Translation-en [300 B]
Des:55 http://mx.archive.ubuntu.com/ubuntu xenial-backports/universe amd64 DEP-11 Metadata [200 B]
Descargados 1 884 kB en 7s (256 kB/s)
Leyendo lista de paquetes... Hecho
Leyendo lista de paquetes... Hecho
Creando árbol de dependencias
Leyendo la información de estado... Hecho
Calculando la actualización... Hecho
Los paquetes indicados a continuación se instalaron de forma automática y ya no son necesarios.
linux-tools-4.4.0-22 linux-tools-4.4.0-22-generic
Utilice «sudo apt autoremove» para eliminarlos.
Se actualizarán los siguientes paquetes:
gambas3-gb-desktop gambas3-gb-form gambas3-gb-gtk gambas3-gb-gui
gambas3-gb-net gambas3-gb-net-curl gambas3-gb-qt4 gambas3-gb-settings
gambas3-runtime libboost-filesystem1.58.0 lsb-base lsb-release snapd tzdata
14 actualizados, 0 nuevos se instalarán, 0 para eliminar y 0 no actualizados.
23 no instalados del todo o eliminados.
Se necesita descargar 5 736 kB/5 774 kB de archivos.
Se utilizarán 827 kB de espacio de disco adicional después de esta operación.
Des:1 http://mx.archive.ubuntu.com/ubuntu xenial-updates/main amd64 lsb-release all 9.20160110ubuntu0.2 [11.8 kB]
Des:2 http://mx.archive.ubuntu.com/ubuntu xenial-updates/main amd64 lsb-base all 9.20160110ubuntu0.2 [13.7 kB]
Des:3 http://mx.archive.ubuntu.com/ubuntu xenial-updates/main amd64 tzdata all 2016f-0ubuntu0.16.04 [168 kB]
Des:4 http://mx.archive.ubuntu.com/ubuntu xenial-updates/universe amd64 gambas3-runtime amd64 3.8.4-2ubuntu3.1 [323 kB]
Des:5 http://mx.archive.ubuntu.com/ubuntu xenial-updates/universe amd64 gambas3-gb-gtk amd64 3.8.4-2ubuntu3.1 [179 kB]
Des:6 http://mx.archive.ubuntu.com/ubuntu xenial-updates/universe amd64 gambas3-gb-qt4 amd64 3.8.4-2ubuntu3.1 [173 kB]
Des:7 http://mx.archive.ubuntu.com/ubuntu xenial-updates/universe amd64 gambas3-gb-gui amd64 3.8.4-2ubuntu3.1 [22.0 kB]
Des:8 http://mx.archive.ubuntu.com/ubuntu xenial-updates/universe amd64 gambas3-gb-settings all 3.8.4-2ubuntu3.1 [15.4 kB]
Des:9 http://mx.archive.ubuntu.com/ubuntu xenial-updates/universe amd64 gambas3-gb-form all 3.8.4-2ubuntu3.1 [237 kB]
Des:10 http://mx.archive.ubuntu.com/ubuntu xenial-updates/universe amd64 gambas3-gb-desktop amd64 3.8.4-2ubuntu3.1 [10.9 kB]
Des:11 http://mx.archive.ubuntu.com/ubuntu xenial-updates/universe amd64 gambas3-gb-net amd64 3.8.4-2ubuntu3.1 [28.3 kB]
Des:12 http://mx.archive.ubuntu.com/ubuntu xenial-updates/universe amd64 gambas3-gb-net-curl amd64 3.8.4-2ubuntu3.1 [24.0 kB]
Des:13 http://mx.archive.ubuntu.com/ubuntu xenial-updates/main amd64 snapd amd64 2.0.10 [4 530 kB]
Descargados 5 736 kB en 15s (362 kB/s)
E: Firma del archivo inválida
E: Error interno, no se pudo localizar el miembro control.tar.{lz4gzxzbz2lzma}
E: Prior errors apply to /var/cache/apt/archives/libboost-filesystem1.58.0_1.58.0+dfsg-5ubuntu3.1_amd64.deb
E: Prior errors apply to /var/cache/apt/archives/snapd_2.0.10_amd64.deb
debconf: fallo al ejecutar «apt-extracttemplates»: No such file or directory
Preconfigurando paquetes ...
(Leyendo la base de datos ... 323206 ficheros o directorios instalados actualmente.)
Preparando para desempaquetar .../lsb-release_9.20160110ubuntu0.2_all.deb ...
Desempaquetando lsb-release (9.20160110ubuntu0.2) sobre (9.20160110ubuntu0.1) ...
Preparando para desempaquetar .../lsb-base_9.20160110ubuntu0.2_all.deb ...
Desempaquetando lsb-base (9.20160110ubuntu0.2) sobre (9.20160110ubuntu0.1) ...
Procesando disparadores para man-db (2.7.5-1) ...
Configurando lsb-base (9.20160110ubuntu0.2) ...
(Leyendo la base de datos ... 323208 ficheros o directorios instalados actualmente.)
Preparando para desempaquetar .../tzdata_2016f-0ubuntu0.16.04_all.deb ...
Desempaquetando tzdata (2016f-0ubuntu0.16.04) sobre (2016d-0ubuntu0.16.04) ...
Preparando para desempaquetar .../gambas3-runtime_3.8.4-2ubuntu3.1_amd64.deb ...
Desempaquetando gambas3-runtime (3.8.4-2ubuntu3.1) sobre (3.8.4-2ubuntu3) ...
Preparando para desempaquetar .../gambas3-gb-gtk_3.8.4-2ubuntu3.1_amd64.deb ...
Desempaquetando gambas3-gb-gtk (3.8.4-2ubuntu3.1) sobre (3.8.4-2ubuntu3) ...
Preparando para desempaquetar .../gambas3-gb-qt4_3.8.4-2ubuntu3.1_amd64.deb ...
Desempaquetando gambas3-gb-qt4 (3.8.4-2ubuntu3.1) sobre (3.8.4-2ubuntu3) ...
Preparando para desempaquetar .../gambas3-gb-gui_3.8.4-2ubuntu3.1_amd64.deb ...
Desempaquetando gambas3-gb-gui (3.8.4-2ubuntu3.1) sobre (3.8.4-2ubuntu3) ...
Preparando para desempaquetar .../gambas3-gb-settings_3.8.4-2ubuntu3.1_all.deb ...
Desempaquetando gambas3-gb-settings (3.8.4-2ubuntu3.1) sobre (3.8.4-2ubuntu3) ...
Preparando para desempaquetar .../gambas3-gb-form_3.8.4-2ubuntu3.1_all.deb ...
Desempaquetando gambas3-gb-form (3.8.4-2ubuntu3.1) sobre (3.8.4-2ubuntu3) ...
Preparando para desempaquetar .../gambas3-gb-desktop_3.8.4-2ubuntu3.1_amd64.deb ...
Desempaquetando gambas3-gb-desktop (3.8.4-2ubuntu3.1) sobre (3.8.4-2ubuntu3) ...
Preparando para desempaquetar .../gambas3-gb-net_3.8.4-2ubuntu3.1_amd64.deb ...
Desempaquetando gambas3-gb-net (3.8.4-2ubuntu3.1) sobre (3.8.4-2ubuntu3) ...
Preparando para desempaquetar .../gambas3-gb-net-curl_3.8.4-2ubuntu3.1_amd64.deb ...
Desempaquetando gambas3-gb-net-curl (3.8.4-2ubuntu3.1) sobre (3.8.4-2ubuntu3) ...
dpkg-deb: error: `/var/cache/apt/archives/libboost-filesystem1.58.0_1.58.0+dfsg-5ubuntu3.1_amd64.deb' no es un archivo en formato debian
dpkg: error al procesar el archivo /var/cache/apt/archives/libboost-filesystem1.58.0_1.58.0+dfsg-5ubuntu3.1_amd64.deb (--unpack):
el subproceso dpkg-deb --control devolvió el código de salida de error 2
Preparando para desempaquetar .../snapd_2.0.10_amd64.deb ...
Warning: Stopping snapd.service, but it can still be activated by:
snapd.socket
Desempaquetando snapd (2.0.10) sobre (2.0.9) ...
Procesando disparadores para libc-bin (2.23-0ubuntu3) ...
Procesando disparadores para shared-mime-info (1.5-2ubuntu0.1) ...
Unknown media type in type 'all/all'
Unknown media type in type 'all/allfiles'
Procesando disparadores para hicolor-icon-theme (0.15-0ubuntu1) ...
Procesando disparadores para man-db (2.7.5-1) ...
Se encontraron errores al procesar:
/var/cache/apt/archives/libboost-filesystem1.58.0_1.58.0+dfsg-5ubuntu3.1_amd64.deb
E: Sub-process /usr/bin/dpkg returned an error code (1)
xxxxx at axxxxxx:~$
ProblemType: Package
DistroRelease: Ubuntu 16.04
Package: libboost-filesystem1.58.0 1.58.0+dfsg-5ubuntu3
ProcVersionSignature: Ubuntu 4.4.0-28.47-generic 4.4.13
Uname: Linux 4.4.0-28-generic x86_64
ApportVersion: 2.20.1-0ubuntu2.1
Architecture: amd64
Date: Sat Jul 9 01:21:39 2016
ErrorMessage: el subproceso dpkg-deb --control devolvió el código de salida de error 2
InstallationDate: Installed on 2016-05-31 (39 days ago)
InstallationMedia: Ubuntu 16.04 LTS "Xenial Xerus" - Release amd64 (20160420.1)
RelatedPackageVersions:
dpkg 1.18.4ubuntu1.1
apt 1.2.12~ubuntu16.04.1
SourcePackage: boost1.58
Title: package libboost-filesystem1.58.0 1.58.0+dfsg-5ubuntu3 failed to install/upgrade: el subproceso dpkg-deb --control devolvió el código de salida de error 2
UpgradeStatus: No upgrade log present (probably fresh install)
** Affects: boost1.58 (Ubuntu)
Importance: Undecided
Status: New
** Tags: amd64 apport-package xenial
--
You received this bug notification because you are a member of Ubuntu
Foundations Bugs, which is subscribed to boost1.58 in Ubuntu.
https://bugs.launchpad.net/bugs/1600430
Title:
package libboost-filesystem1.58.0 1.58.0+dfsg-5ubuntu3 failed to
install/upgrade: el subproceso dpkg-deb --control devolvió el código
de salida de error 2
Status in boost1.58 package in Ubuntu:
New
Bug description:
xxxxx at xxxxxx:~$ sudo apt-get update && sudo apt-get dist-upgrade -y
[sudo] password for xxxxx:
Lo sentimos, vuelva a intentarlo.
[sudo] password for xxxxx:
Obj:1 http://ppa.launchpad.net/atareao/atareao/ubuntu xenial InRelease
Obj:2 http://archive.canonical.com/ubuntu xenial InRelease
Des:3 http://security.ubuntu.com/ubuntu xenial-security InRelease [94.5 kB]
Obj:4 http://mx.archive.ubuntu.com/ubuntu xenial InRelease
Obj:6 http://ppa.launchpad.net/atareao/telegram/ubuntu xenial InRelease
Obj:7 http://repository.spotify.com stable InRelease
Des:8 http://mx.archive.ubuntu.com/ubuntu xenial-updates InRelease [94.5 kB]
Obj:9 http://ppa.launchpad.net/clipgrab-team/ppa/ubuntu xenial InRelease
Obj:10 http://ppa.launchpad.net/gezakovacs/ppa/ubuntu xenial InRelease
Obj:5 http://screenshots.getdeb.net xenial-getdeb InRelease
Obj:11 http://ppa.launchpad.net/indicator-brightness/ppa/ubuntu xenial InRelease
Des:12 http://mx.archive.ubuntu.com/ubuntu xenial-backports InRelease [92.2 kB]
Obj:13 http://ppa.launchpad.net/moka/stable/ubuntu xenial InRelease
Obj:14 http://ppa.launchpad.net/nemh/systemback/ubuntu xenial InRelease
Obj:15 http://ppa.launchpad.net/nilarimogard/webupd8/ubuntu xenial InRelease
Obj:16 http://ppa.launchpad.net/noobslab/macbuntu/ubuntu xenial InRelease
Obj:17 http://ppa.launchpad.net/numix/ppa/ubuntu xenial InRelease
Obj:18 http://ppa.launchpad.net/otto-kesselgulasch/gimp/ubuntu xenial InRelease
Des:19 https://deb.opera.com/opera-developer stable InRelease [2 592 B]
Des:20 http://security.ubuntu.com/ubuntu xenial-security/main amd64 Packages [117 kB]
Obj:21 http://ppa.launchpad.net/pulb/mailnag/ubuntu xenial InRelease
Des:22 https://deb.opera.com/opera-stable stable InRelease [2 592 B]
Obj:23 http://ppa.launchpad.net/tails-team/tails-installer/ubuntu xenial InRelease
Des:24 http://mx.archive.ubuntu.com/ubuntu xenial-updates/main amd64 Packages [248 kB]
Des:25 http://ppa.launchpad.net/varlesh-l/papirus-pack/ubuntu xenial InRelease [18.1 kB]
Des:26 http://security.ubuntu.com/ubuntu xenial-security/main i386 Packages [114 kB]
Obj:27 http://ppa.launchpad.net/webupd8team/java/ubuntu xenial InRelease
Des:28 http://security.ubuntu.com/ubuntu xenial-security/main Translation-en [44.8 kB]
Des:29 http://security.ubuntu.com/ubuntu xenial-security/main amd64 DEP-11 Metadata [44.0 kB]
Des:30 http://security.ubuntu.com/ubuntu xenial-security/main DEP-11 64x64 Icons [50.8 kB]
Des:31 http://security.ubuntu.com/ubuntu xenial-security/universe amd64 Packages [33.2 kB]
Des:32 https://deb.opera.com/opera-developer stable/non-free amd64 Packages [1 813 B]
Des:33 https://deb.opera.com/opera-developer stable/non-free i386 Packages [1 821 B]
Des:34 https://deb.opera.com/opera-stable stable/non-free amd64 Packages [1 813 B]
Des:35 http://mx.archive.ubuntu.com/ubuntu xenial-updates/main i386 Packages [244 kB]
Des:36 http://ppa.launchpad.net/varlesh-l/papirus-pack/ubuntu xenial/main amd64 Packages [1 964 B]
Des:37 https://deb.opera.com/opera-stable stable/non-free i386 Packages [1 821 B]
Des:38 http://security.ubuntu.com/ubuntu xenial-security/universe i386 Packages [33.2 kB]
Des:39 http://ppa.launchpad.net/varlesh-l/papirus-pack/ubuntu xenial/main i386 Packages [1 964 B]
Des:40 http://security.ubuntu.com/ubuntu xenial-security/universe Translation-en [19.9 kB]
Des:41 http://security.ubuntu.com/ubuntu xenial-security/universe amd64 DEP-11 Metadata [2 327 B]
Des:42 http://mx.archive.ubuntu.com/ubuntu xenial-updates/main Translation-en [98.1 kB]
Des:43 http://mx.archive.ubuntu.com/ubuntu xenial-updates/universe amd64 Packages [152 kB]
Des:44 http://mx.archive.ubuntu.com/ubuntu xenial-updates/universe i386 Packages [149 kB]
Des:45 http://mx.archive.ubuntu.com/ubuntu xenial-updates/universe Translation-en [74.9 kB]
Des:46 http://mx.archive.ubuntu.com/ubuntu xenial-updates/universe amd64 DEP-11 Metadata [69.3 kB]
Des:47 http://mx.archive.ubuntu.com/ubuntu xenial-updates/universe DEP-11 64x64 Icons [71.0 kB]
Des:48 http://mx.archive.ubuntu.com/ubuntu xenial-backports/main amd64 Packages [676 B]
Des:49 http://mx.archive.ubuntu.com/ubuntu xenial-backports/main i386 Packages [676 B]
Des:50 http://mx.archive.ubuntu.com/ubuntu xenial-backports/main Translation-en [524 B]
Des:51 http://mx.archive.ubuntu.com/ubuntu xenial-backports/main amd64 DEP-11 Metadata [197 B]
Des:52 http://mx.archive.ubuntu.com/ubuntu xenial-backports/universe amd64 Packages [608 B]
Des:53 http://mx.archive.ubuntu.com/ubuntu xenial-backports/universe i386 Packages [612 B]
Des:54 http://mx.archive.ubuntu.com/ubuntu xenial-backports/universe Translation-en [300 B]
Des:55 http://mx.archive.ubuntu.com/ubuntu xenial-backports/universe amd64 DEP-11 Metadata [200 B]
Descargados 1 884 kB en 7s (256 kB/s)
Leyendo lista de paquetes... Hecho
Leyendo lista de paquetes... Hecho
Creando árbol de dependencias
Leyendo la información de estado... Hecho
Calculando la actualización... Hecho
Los paquetes indicados a continuación se instalaron de forma automática y ya no son necesarios.
linux-tools-4.4.0-22 linux-tools-4.4.0-22-generic
Utilice «sudo apt autoremove» para eliminarlos.
Se actualizarán los siguientes paquetes:
gambas3-gb-desktop gambas3-gb-form gambas3-gb-gtk gambas3-gb-gui
gambas3-gb-net gambas3-gb-net-curl gambas3-gb-qt4 gambas3-gb-settings
gambas3-runtime libboost-filesystem1.58.0 lsb-base lsb-release snapd tzdata
14 actualizados, 0 nuevos se instalarán, 0 para eliminar y 0 no actualizados.
23 no instalados del todo o eliminados.
Se necesita descargar 5 736 kB/5 774 kB de archivos.
Se utilizarán 827 kB de espacio de disco adicional después de esta operación.
Des:1 http://mx.archive.ubuntu.com/ubuntu xenial-updates/main amd64 lsb-release all 9.20160110ubuntu0.2 [11.8 kB]
Des:2 http://mx.archive.ubuntu.com/ubuntu xenial-updates/main amd64 lsb-base all 9.20160110ubuntu0.2 [13.7 kB]
Des:3 http://mx.archive.ubuntu.com/ubuntu xenial-updates/main amd64 tzdata all 2016f-0ubuntu0.16.04 [168 kB]
Des:4 http://mx.archive.ubuntu.com/ubuntu xenial-updates/universe amd64 gambas3-runtime amd64 3.8.4-2ubuntu3.1 [323 kB]
Des:5 http://mx.archive.ubuntu.com/ubuntu xenial-updates/universe amd64 gambas3-gb-gtk amd64 3.8.4-2ubuntu3.1 [179 kB]
Des:6 http://mx.archive.ubuntu.com/ubuntu xenial-updates/universe amd64 gambas3-gb-qt4 amd64 3.8.4-2ubuntu3.1 [173 kB]
Des:7 http://mx.archive.ubuntu.com/ubuntu xenial-updates/universe amd64 gambas3-gb-gui amd64 3.8.4-2ubuntu3.1 [22.0 kB]
Des:8 http://mx.archive.ubuntu.com/ubuntu xenial-updates/universe amd64 gambas3-gb-settings all 3.8.4-2ubuntu3.1 [15.4 kB]
Des:9 http://mx.archive.ubuntu.com/ubuntu xenial-updates/universe amd64 gambas3-gb-form all 3.8.4-2ubuntu3.1 [237 kB]
Des:10 http://mx.archive.ubuntu.com/ubuntu xenial-updates/universe amd64 gambas3-gb-desktop amd64 3.8.4-2ubuntu3.1 [10.9 kB]
Des:11 http://mx.archive.ubuntu.com/ubuntu xenial-updates/universe amd64 gambas3-gb-net amd64 3.8.4-2ubuntu3.1 [28.3 kB]
Des:12 http://mx.archive.ubuntu.com/ubuntu xenial-updates/universe amd64 gambas3-gb-net-curl amd64 3.8.4-2ubuntu3.1 [24.0 kB]
Des:13 http://mx.archive.ubuntu.com/ubuntu xenial-updates/main amd64 snapd amd64 2.0.10 [4 530 kB]
Descargados 5 736 kB en 15s (362 kB/s)
E: Firma del archivo inválida
E: Error interno, no se pudo localizar el miembro control.tar.{lz4gzxzbz2lzma}
E: Prior errors apply to /var/cache/apt/archives/libboost-filesystem1.58.0_1.58.0+dfsg-5ubuntu3.1_amd64.deb
E: Prior errors apply to /var/cache/apt/archives/snapd_2.0.10_amd64.deb
debconf: fallo al ejecutar «apt-extracttemplates»: No such file or directory
Preconfigurando paquetes ...
(Leyendo la base de datos ... 323206 ficheros o directorios instalados actualmente.)
Preparando para desempaquetar .../lsb-release_9.20160110ubuntu0.2_all.deb ...
Desempaquetando lsb-release (9.20160110ubuntu0.2) sobre (9.20160110ubuntu0.1) ...
Preparando para desempaquetar .../lsb-base_9.20160110ubuntu0.2_all.deb ...
Desempaquetando lsb-base (9.20160110ubuntu0.2) sobre (9.20160110ubuntu0.1) ...
Procesando disparadores para man-db (2.7.5-1) ...
Configurando lsb-base (9.20160110ubuntu0.2) ...
(Leyendo la base de datos ... 323208 ficheros o directorios instalados actualmente.)
Preparando para desempaquetar .../tzdata_2016f-0ubuntu0.16.04_all.deb ...
Desempaquetando tzdata (2016f-0ubuntu0.16.04) sobre (2016d-0ubuntu0.16.04) ...
Preparando para desempaquetar .../gambas3-runtime_3.8.4-2ubuntu3.1_amd64.deb ...
Desempaquetando gambas3-runtime (3.8.4-2ubuntu3.1) sobre (3.8.4-2ubuntu3) ...
Preparando para desempaquetar .../gambas3-gb-gtk_3.8.4-2ubuntu3.1_amd64.deb ...
Desempaquetando gambas3-gb-gtk (3.8.4-2ubuntu3.1) sobre (3.8.4-2ubuntu3) ...
Preparando para desempaquetar .../gambas3-gb-qt4_3.8.4-2ubuntu3.1_amd64.deb ...
Desempaquetando gambas3-gb-qt4 (3.8.4-2ubuntu3.1) sobre (3.8.4-2ubuntu3) ...
Preparando para desempaquetar .../gambas3-gb-gui_3.8.4-2ubuntu3.1_amd64.deb ...
Desempaquetando gambas3-gb-gui (3.8.4-2ubuntu3.1) sobre (3.8.4-2ubuntu3) ...
Preparando para desempaquetar .../gambas3-gb-settings_3.8.4-2ubuntu3.1_all.deb ...
Desempaquetando gambas3-gb-settings (3.8.4-2ubuntu3.1) sobre (3.8.4-2ubuntu3) ...
Preparando para desempaquetar .../gambas3-gb-form_3.8.4-2ubuntu3.1_all.deb ...
Desempaquetando gambas3-gb-form (3.8.4-2ubuntu3.1) sobre (3.8.4-2ubuntu3) ...
Preparando para desempaquetar .../gambas3-gb-desktop_3.8.4-2ubuntu3.1_amd64.deb ...
Desempaquetando gambas3-gb-desktop (3.8.4-2ubuntu3.1) sobre (3.8.4-2ubuntu3) ...
Preparando para desempaquetar .../gambas3-gb-net_3.8.4-2ubuntu3.1_amd64.deb ...
Desempaquetando gambas3-gb-net (3.8.4-2ubuntu3.1) sobre (3.8.4-2ubuntu3) ...
Preparando para desempaquetar .../gambas3-gb-net-curl_3.8.4-2ubuntu3.1_amd64.deb ...
Desempaquetando gambas3-gb-net-curl (3.8.4-2ubuntu3.1) sobre (3.8.4-2ubuntu3) ...
dpkg-deb: error: `/var/cache/apt/archives/libboost-filesystem1.58.0_1.58.0+dfsg-5ubuntu3.1_amd64.deb' no es un archivo en formato debian
dpkg: error al procesar el archivo /var/cache/apt/archives/libboost-filesystem1.58.0_1.58.0+dfsg-5ubuntu3.1_amd64.deb (--unpack):
el subproceso dpkg-deb --control devolvió el código de salida de error 2
Preparando para desempaquetar .../snapd_2.0.10_amd64.deb ...
Warning: Stopping snapd.service, but it can still be activated by:
snapd.socket
Desempaquetando snapd (2.0.10) sobre (2.0.9) ...
Procesando disparadores para libc-bin (2.23-0ubuntu3) ...
Procesando disparadores para shared-mime-info (1.5-2ubuntu0.1) ...
Unknown media type in type 'all/all'
Unknown media type in type 'all/allfiles'
Procesando disparadores para hicolor-icon-theme (0.15-0ubuntu1) ...
Procesando disparadores para man-db (2.7.5-1) ...
Se encontraron errores al procesar:
/var/cache/apt/archives/libboost-filesystem1.58.0_1.58.0+dfsg-5ubuntu3.1_amd64.deb
E: Sub-process /usr/bin/dpkg returned an error code (1)
xxxxx at axxxxxx:~$
ProblemType: Package
DistroRelease: Ubuntu 16.04
Package: libboost-filesystem1.58.0 1.58.0+dfsg-5ubuntu3
ProcVersionSignature: Ubuntu 4.4.0-28.47-generic 4.4.13
Uname: Linux 4.4.0-28-generic x86_64
ApportVersion: 2.20.1-0ubuntu2.1
Architecture: amd64
Date: Sat Jul 9 01:21:39 2016
ErrorMessage: el subproceso dpkg-deb --control devolvió el código de salida de error 2
InstallationDate: Installed on 2016-05-31 (39 days ago)
InstallationMedia: Ubuntu 16.04 LTS "Xenial Xerus" - Release amd64 (20160420.1)
RelatedPackageVersions:
dpkg 1.18.4ubuntu1.1
apt 1.2.12~ubuntu16.04.1
SourcePackage: boost1.58
Title: package libboost-filesystem1.58.0 1.58.0+dfsg-5ubuntu3 failed to install/upgrade: el subproceso dpkg-deb --control devolvió el código de salida de error 2
UpgradeStatus: No upgrade log present (probably fresh install)
To manage notifications about this bug go to:
https://bugs.launchpad.net/ubuntu/+source/boost1.58/+bug/1600430/+subscriptions
More information about the foundations-bugs
mailing list