[Bug 1597370] Re: ubuntu-defaults-builder fails to build in 16.04 LTS

Matthias Klose doko at ubuntu.com
Tue Jul 5 15:22:58 UTC 2016


0.55~16.04.2 successfully built.

** Tags removed: verification-needed
** Tags added: verification-done

-- 
You received this bug notification because you are a member of Ubuntu
Foundations Bugs, which is subscribed to ubuntu-defaults-builder in
Ubuntu.
https://bugs.launchpad.net/bugs/1597370

Title:
  ubuntu-defaults-builder fails to build in 16.04 LTS

Status in ubuntu-defaults-builder package in Ubuntu:
  Fix Released
Status in ubuntu-defaults-builder source package in Xenial:
  Fix Committed

Bug description:
  ubuntu-defaults-builder fails to build in 16.04 LTS, fixed in yakkety,
  upload the yakkety version to xenial.

  acceptance criteria: the package builds and passes the tests.

  [...]
  ======================================================================
  FAIL: test_webbrowser (__main__.T)
  webbrowser/
  ----------------------------------------------------------------------
  Traceback (most recent call last):
    File "test/run", line 259, in test_webbrowser
      self.build()
    File "test/run", line 63, in build
      self.fail('lintian errors:\n' + lintian)
  AssertionError: lintian errors:
  W: defaults-test source: out-of-date-standards-version 3.9.6 (current is 3.9.7)

  ----------------------------------------------------------------------
  Ran 26 tests in 86.489s

  FAILED (failures=19)
  make[2]: *** [check] Error 1
  Makefile:4: recipe for target 'check' failed
  make[2]: Leaving directory '/«PKGBUILDDIR»'

To manage notifications about this bug go to:
https://bugs.launchpad.net/ubuntu/+source/ubuntu-defaults-builder/+bug/1597370/+subscriptions



More information about the foundations-bugs mailing list