[Bug 1617721] [NEW] package grub-efi-amd64-signed 1.66.2+2.02~beta2-36ubuntu3.2 failed to install/upgrade: subprocess installed post-installation script returned error exit status 1
tomazzoni
1617721 at bugs.launchpad.net
Sun Aug 28 09:45:57 UTC 2016
Public bug reported:
package grub-efi-amd64-signed 1.66.2+2.02~beta2-36ubuntu3.2 failed to
install/upgrade: subprocess installed post-installation script returned
error exit status 1
ProblemType: Package
DistroRelease: Ubuntu 16.04
Package: grub-efi-amd64-signed 1.66.2+2.02~beta2-36ubuntu3.2
ProcVersionSignature: Ubuntu 4.4.0-34.53-generic 4.4.15
Uname: Linux 4.4.0-34-generic x86_64
NonfreeKernelModules: talpa_vfshook talpa_pedconnector talpa_pedevice talpa_vcdevice talpa_core talpa_linux talpa_syscallhook
ApportVersion: 2.20.1-0ubuntu2.1
Architecture: amd64
Date: Sat Aug 27 18:07:19 2016
DuplicateSignature:
package:grub-efi-amd64-signed:1.66.2+2.02~beta2-36ubuntu3.2
Setting up grub-efi-amd64-signed (1.66.2+2.02~beta2-36ubuntu3.2) ...
grub-install: error: /usr/lib/grub/i386-pc/modinfo.sh doesn't exist. Please specify --target or --directory.
dpkg: error processing package grub-efi-amd64-signed (--configure):
subprocess installed post-installation script returned error exit status 1
ErrorMessage: subprocess installed post-installation script returned error exit status 1
InstallationDate: Installed on 2016-06-04 (84 days ago)
InstallationMedia: Ubuntu 16.04 LTS "Xenial Xerus" - Release amd64 (20160420.1)
RelatedPackageVersions:
dpkg 1.18.4ubuntu1.1
apt 1.2.12~ubuntu16.04.1
SourcePackage: grub2-signed
Title: package grub-efi-amd64-signed 1.66.2+2.02~beta2-36ubuntu3.2 failed to install/upgrade: subprocess installed post-installation script returned error exit status 1
UpgradeStatus: No upgrade log present (probably fresh install)
** Affects: grub2-signed (Ubuntu)
Importance: Undecided
Status: New
** Tags: amd64 apport-package xenial
--
You received this bug notification because you are a member of Ubuntu
Foundations Bugs, which is subscribed to grub2-signed in Ubuntu.
https://bugs.launchpad.net/bugs/1617721
Title:
package grub-efi-amd64-signed 1.66.2+2.02~beta2-36ubuntu3.2 failed to
install/upgrade: subprocess installed post-installation script
returned error exit status 1
Status in grub2-signed package in Ubuntu:
New
Bug description:
package grub-efi-amd64-signed 1.66.2+2.02~beta2-36ubuntu3.2 failed to
install/upgrade: subprocess installed post-installation script
returned error exit status 1
ProblemType: Package
DistroRelease: Ubuntu 16.04
Package: grub-efi-amd64-signed 1.66.2+2.02~beta2-36ubuntu3.2
ProcVersionSignature: Ubuntu 4.4.0-34.53-generic 4.4.15
Uname: Linux 4.4.0-34-generic x86_64
NonfreeKernelModules: talpa_vfshook talpa_pedconnector talpa_pedevice talpa_vcdevice talpa_core talpa_linux talpa_syscallhook
ApportVersion: 2.20.1-0ubuntu2.1
Architecture: amd64
Date: Sat Aug 27 18:07:19 2016
DuplicateSignature:
package:grub-efi-amd64-signed:1.66.2+2.02~beta2-36ubuntu3.2
Setting up grub-efi-amd64-signed (1.66.2+2.02~beta2-36ubuntu3.2) ...
grub-install: error: /usr/lib/grub/i386-pc/modinfo.sh doesn't exist. Please specify --target or --directory.
dpkg: error processing package grub-efi-amd64-signed (--configure):
subprocess installed post-installation script returned error exit status 1
ErrorMessage: subprocess installed post-installation script returned error exit status 1
InstallationDate: Installed on 2016-06-04 (84 days ago)
InstallationMedia: Ubuntu 16.04 LTS "Xenial Xerus" - Release amd64 (20160420.1)
RelatedPackageVersions:
dpkg 1.18.4ubuntu1.1
apt 1.2.12~ubuntu16.04.1
SourcePackage: grub2-signed
Title: package grub-efi-amd64-signed 1.66.2+2.02~beta2-36ubuntu3.2 failed to install/upgrade: subprocess installed post-installation script returned error exit status 1
UpgradeStatus: No upgrade log present (probably fresh install)
To manage notifications about this bug go to:
https://bugs.launchpad.net/ubuntu/+source/grub2-signed/+bug/1617721/+subscriptions
More information about the foundations-bugs
mailing list