[Bug 1609740] Re: please investigate ppc64el networkd-test.py failure

Iain Lane iain at orangesquash.org.uk
Thu Aug 4 10:49:19 UTC 2016


** Changed in: systemd (Ubuntu)
     Assignee: (unassigned) => Martin Pitt (pitti)

-- 
You received this bug notification because you are a member of Ubuntu
Foundations Bugs, which is subscribed to systemd in Ubuntu.
https://bugs.launchpad.net/bugs/1609740

Title:
  please investigate ppc64el networkd-test.py failure

Status in systemd package in Ubuntu:
  New

Bug description:
  As said, systemd 231 migrated because the test was probably skipped,
  and now other stuff is not migrating because the force-skiptest has
  been removed.

  can you please investigate the failure?

  thanks

  autopkgtest [17:41:14]: test networkd-test.py: [-----------------------
  test_coldplug_dhcp_ip4_only (__main__.DnsmasqClientTest) ... Cannot find device "router_eth42"
  ERROR
  ERROR
  test_coldplug_dhcp_ip4_only_no_ra (__main__.DnsmasqClientTest) ... ERROR
  ERROR
  test_coldplug_dhcp_ip6 (__main__.DnsmasqClientTest) ... Cannot find device "router_eth42"
  Cannot find device "router_eth42"
  ERROR
  ERROR
  test_coldplug_dhcp_yes_ip4 (__main__.DnsmasqClientTest) ... ERROR
  ERROR
  test_coldplug_dhcp_yes_ip4_no_ra (__main__.DnsmasqClientTest) ... Cannot find device "router_eth42"
  Cannot find device "router_eth42"
  ERROR
  ERROR
  test_hotplug_dhcp_ip4 (__main__.DnsmasqClientTest) ... ERROR
  ERROR
  test_hotplug_dhcp_ip6 (__main__.DnsmasqClientTest) ... Cannot find device "router_eth42"
  Cannot find device "router_eth42"
  ERROR
  ERROR
  test_route_only_dns (__main__.DnsmasqClientTest) ... ERROR
  ERROR
  test_coldplug_dhcp_ip4_only (__main__.NetworkdClientTest) ... Cannot find device "router_eth42"
  ERROR
  ERROR
  test_coldplug_dhcp_ip4_only_no_ra (__main__.NetworkdClientTest) ... ERROR
  ERROR
  test_coldplug_dhcp_ip6 (__main__.NetworkdClientTest) ... skipped 'networkd does not have DHCPv6 server support'
  test_coldplug_dhcp_yes_ip4 (__main__.NetworkdClientTest) ... ERROR
  ERROR
  test_coldplug_dhcp_yes_ip4_no_ra (__main__.NetworkdClientTest) ... ERROR
  ERROR
  test_hotplug_dhcp_ip4 (__main__.NetworkdClientTest) ... ERROR
  ERROR
  test_hotplug_dhcp_ip6 (__main__.NetworkdClientTest) ... skipped 'networkd does not have DHCPv6 server support'
  test_route_only_dns (__main__.NetworkdClientTest) ... ERROR
  ERROR
  test_search_domains (__main__.NetworkdClientTest) ... FAIL
  test_search_domains_too_long (__main__.NetworkdClientTest) ... FAIL

  ======================================================================
  ERROR: test_coldplug_dhcp_ip4_only (__main__.DnsmasqClientTest)
  ----------------------------------------------------------------------
  Traceback (most recent call last):
    File "/tmp/autopkgtest.bPdU1c/build.8Lb/systemd-231/test/networkd-test.py", line 210, in test_coldplug_dhcp_ip4_only
      online_timeout=15)
    File "/tmp/autopkgtest.bPdU1c/build.8Lb/systemd-231/test/networkd-test.py", line 109, in do_test
      subprocess.check_call(['systemctl', 'start', 'systemd-resolved'])
    File "/usr/lib/python3.5/subprocess.py", line 581, in check_call
      raise CalledProcessError(retcode, cmd)
  subprocess.CalledProcessError: Command '['systemctl', 'start', 'systemd-resolved']' returned non-zero exit status 1

  ======================================================================
  ERROR: test_coldplug_dhcp_ip4_only (__main__.DnsmasqClientTest)
  ----------------------------------------------------------------------
  Traceback (most recent call last):
    File "/tmp/autopkgtest.bPdU1c/build.8Lb/systemd-231/test/networkd-test.py", line 79, in tearDown
      self.shutdown_iface()
    File "/tmp/autopkgtest.bPdU1c/build.8Lb/systemd-231/test/networkd-test.py", line 294, in shutdown_iface
      subprocess.check_call(['ip', 'link', 'del', 'dev', self.if_router])
    File "/usr/lib/python3.5/subprocess.py", line 581, in check_call
      raise CalledProcessError(retcode, cmd)
  subprocess.CalledProcessError: Command '['ip', 'link', 'del', 'dev', 'router_eth42']' returned non-zero exit status 1

  ======================================================================
  ERROR: test_coldplug_dhcp_ip4_only_no_ra (__main__.DnsmasqClientTest)
  ----------------------------------------------------------------------
  Traceback (most recent call last):
    File "/tmp/autopkgtest.bPdU1c/build.8Lb/systemd-231/test/networkd-test.py", line 215, in test_coldplug_dhcp_ip4_only_no_ra
      extra_opts='IPv6AcceptRA=False')
    File "/tmp/autopkgtest.bPdU1c/build.8Lb/systemd-231/test/networkd-test.py", line 109, in do_test
      subprocess.check_call(['systemctl', 'start', 'systemd-resolved'])
    File "/usr/lib/python3.5/subprocess.py", line 581, in check_call
      raise CalledProcessError(retcode, cmd)
  subprocess.CalledProcessError: Command '['systemctl', 'start', 'systemd-resolved']' returned non-zero exit status 1

  ======================================================================
  ERROR: test_coldplug_dhcp_ip4_only_no_ra (__main__.DnsmasqClientTest)
  ----------------------------------------------------------------------
  Traceback (most recent call last):
    File "/tmp/autopkgtest.bPdU1c/build.8Lb/systemd-231/test/networkd-test.py", line 79, in tearDown
      self.shutdown_iface()
    File "/tmp/autopkgtest.bPdU1c/build.8Lb/systemd-231/test/networkd-test.py", line 294, in shutdown_iface
      subprocess.check_call(['ip', 'link', 'del', 'dev', self.if_router])
    File "/usr/lib/python3.5/subprocess.py", line 581, in check_call
      raise CalledProcessError(retcode, cmd)
  subprocess.CalledProcessError: Command '['ip', 'link', 'del', 'dev', 'router_eth42']' returned non-zero exit status 1

  ======================================================================
  ERROR: test_coldplug_dhcp_ip6 (__main__.DnsmasqClientTest)
  ----------------------------------------------------------------------
  Traceback (most recent call last):
    File "/tmp/autopkgtest.bPdU1c/build.8Lb/systemd-231/test/networkd-test.py", line 218, in test_coldplug_dhcp_ip6
      self.do_test(coldplug=True, ipv6=True)
    File "/tmp/autopkgtest.bPdU1c/build.8Lb/systemd-231/test/networkd-test.py", line 109, in do_test
      subprocess.check_call(['systemctl', 'start', 'systemd-resolved'])
    File "/usr/lib/python3.5/subprocess.py", line 581, in check_call
      raise CalledProcessError(retcode, cmd)
  subprocess.CalledProcessError: Command '['systemctl', 'start', 'systemd-resolved']' returned non-zero exit status 1

  ======================================================================
  ERROR: test_coldplug_dhcp_ip6 (__main__.DnsmasqClientTest)
  ----------------------------------------------------------------------
  Traceback (most recent call last):
    File "/tmp/autopkgtest.bPdU1c/build.8Lb/systemd-231/test/networkd-test.py", line 79, in tearDown
      self.shutdown_iface()
    File "/tmp/autopkgtest.bPdU1c/build.8Lb/systemd-231/test/networkd-test.py", line 294, in shutdown_iface
      subprocess.check_call(['ip', 'link', 'del', 'dev', self.if_router])
    File "/usr/lib/python3.5/subprocess.py", line 581, in check_call
      raise CalledProcessError(retcode, cmd)
  subprocess.CalledProcessError: Command '['ip', 'link', 'del', 'dev', 'router_eth42']' returned non-zero exit status 1

  ======================================================================
  ERROR: test_coldplug_dhcp_yes_ip4 (__main__.DnsmasqClientTest)
  ----------------------------------------------------------------------
  Traceback (most recent call last):
    File "/tmp/autopkgtest.bPdU1c/build.8Lb/systemd-231/test/networkd-test.py", line 200, in test_coldplug_dhcp_yes_ip4
      self.do_test(coldplug=True, ipv6=False, online_timeout=15)
    File "/tmp/autopkgtest.bPdU1c/build.8Lb/systemd-231/test/networkd-test.py", line 109, in do_test
      subprocess.check_call(['systemctl', 'start', 'systemd-resolved'])
    File "/usr/lib/python3.5/subprocess.py", line 581, in check_call
      raise CalledProcessError(retcode, cmd)
  subprocess.CalledProcessError: Command '['systemctl', 'start', 'systemd-resolved']' returned non-zero exit status 1

  ======================================================================
  ERROR: test_coldplug_dhcp_yes_ip4 (__main__.DnsmasqClientTest)
  ----------------------------------------------------------------------
  Traceback (most recent call last):
    File "/tmp/autopkgtest.bPdU1c/build.8Lb/systemd-231/test/networkd-test.py", line 79, in tearDown
      self.shutdown_iface()
    File "/tmp/autopkgtest.bPdU1c/build.8Lb/systemd-231/test/networkd-test.py", line 294, in shutdown_iface
      subprocess.check_call(['ip', 'link', 'del', 'dev', self.if_router])
    File "/usr/lib/python3.5/subprocess.py", line 581, in check_call
      raise CalledProcessError(retcode, cmd)
  subprocess.CalledProcessError: Command '['ip', 'link', 'del', 'dev', 'router_eth42']' returned non-zero exit status 1

  ======================================================================
  ERROR: test_coldplug_dhcp_yes_ip4_no_ra (__main__.DnsmasqClientTest)
  ----------------------------------------------------------------------
  Traceback (most recent call last):
    File "/tmp/autopkgtest.bPdU1c/build.8Lb/systemd-231/test/networkd-test.py", line 205, in test_coldplug_dhcp_yes_ip4_no_ra
      extra_opts='IPv6AcceptRA=False')
    File "/tmp/autopkgtest.bPdU1c/build.8Lb/systemd-231/test/networkd-test.py", line 109, in do_test
      subprocess.check_call(['systemctl', 'start', 'systemd-resolved'])
    File "/usr/lib/python3.5/subprocess.py", line 581, in check_call
      raise CalledProcessError(retcode, cmd)
  subprocess.CalledProcessError: Command '['systemctl', 'start', 'systemd-resolved']' returned non-zero exit status 1

  ======================================================================
  ERROR: test_coldplug_dhcp_yes_ip4_no_ra (__main__.DnsmasqClientTest)
  ----------------------------------------------------------------------
  Traceback (most recent call last):
    File "/tmp/autopkgtest.bPdU1c/build.8Lb/systemd-231/test/networkd-test.py", line 79, in tearDown
      self.shutdown_iface()
    File "/tmp/autopkgtest.bPdU1c/build.8Lb/systemd-231/test/networkd-test.py", line 294, in shutdown_iface
      subprocess.check_call(['ip', 'link', 'del', 'dev', self.if_router])
    File "/usr/lib/python3.5/subprocess.py", line 581, in check_call
      raise CalledProcessError(retcode, cmd)
  subprocess.CalledProcessError: Command '['ip', 'link', 'del', 'dev', 'router_eth42']' returned non-zero exit status 1

  ======================================================================
  ERROR: test_hotplug_dhcp_ip4 (__main__.DnsmasqClientTest)
  ----------------------------------------------------------------------
  Traceback (most recent call last):
    File "/tmp/autopkgtest.bPdU1c/build.8Lb/systemd-231/test/networkd-test.py", line 222, in test_hotplug_dhcp_ip4
      self.do_test(coldplug=False, ipv6=False, online_timeout=15)
    File "/tmp/autopkgtest.bPdU1c/build.8Lb/systemd-231/test/networkd-test.py", line 109, in do_test
      subprocess.check_call(['systemctl', 'start', 'systemd-resolved'])
    File "/usr/lib/python3.5/subprocess.py", line 581, in check_call
      raise CalledProcessError(retcode, cmd)
  subprocess.CalledProcessError: Command '['systemctl', 'start', 'systemd-resolved']' returned non-zero exit status 1

  ======================================================================
  ERROR: test_hotplug_dhcp_ip4 (__main__.DnsmasqClientTest)
  ----------------------------------------------------------------------
  Traceback (most recent call last):
    File "/tmp/autopkgtest.bPdU1c/build.8Lb/systemd-231/test/networkd-test.py", line 79, in tearDown
      self.shutdown_iface()
    File "/tmp/autopkgtest.bPdU1c/build.8Lb/systemd-231/test/networkd-test.py", line 294, in shutdown_iface
      subprocess.check_call(['ip', 'link', 'del', 'dev', self.if_router])
    File "/usr/lib/python3.5/subprocess.py", line 581, in check_call
      raise CalledProcessError(retcode, cmd)
  subprocess.CalledProcessError: Command '['ip', 'link', 'del', 'dev', 'router_eth42']' returned non-zero exit status 1

  ======================================================================
  ERROR: test_hotplug_dhcp_ip6 (__main__.DnsmasqClientTest)
  ----------------------------------------------------------------------
  Traceback (most recent call last):
    File "/tmp/autopkgtest.bPdU1c/build.8Lb/systemd-231/test/networkd-test.py", line 225, in test_hotplug_dhcp_ip6
      self.do_test(coldplug=False, ipv6=True)
    File "/tmp/autopkgtest.bPdU1c/build.8Lb/systemd-231/test/networkd-test.py", line 109, in do_test
      subprocess.check_call(['systemctl', 'start', 'systemd-resolved'])
    File "/usr/lib/python3.5/subprocess.py", line 581, in check_call
      raise CalledProcessError(retcode, cmd)
  subprocess.CalledProcessError: Command '['systemctl', 'start', 'systemd-resolved']' returned non-zero exit status 1

  ======================================================================
  ERROR: test_hotplug_dhcp_ip6 (__main__.DnsmasqClientTest)
  ----------------------------------------------------------------------
  Traceback (most recent call last):
    File "/tmp/autopkgtest.bPdU1c/build.8Lb/systemd-231/test/networkd-test.py", line 79, in tearDown
      self.shutdown_iface()
    File "/tmp/autopkgtest.bPdU1c/build.8Lb/systemd-231/test/networkd-test.py", line 294, in shutdown_iface
      subprocess.check_call(['ip', 'link', 'del', 'dev', self.if_router])
    File "/usr/lib/python3.5/subprocess.py", line 581, in check_call
      raise CalledProcessError(retcode, cmd)
  subprocess.CalledProcessError: Command '['ip', 'link', 'del', 'dev', 'router_eth42']' returned non-zero exit status 1

  ======================================================================
  ERROR: test_route_only_dns (__main__.DnsmasqClientTest)
  ----------------------------------------------------------------------
  Traceback (most recent call last):
    File "/tmp/autopkgtest.bPdU1c/build.8Lb/systemd-231/test/networkd-test.py", line 244, in test_route_only_dns
      extra_opts='IPv6AcceptRouterAdvertisements=False')
    File "/tmp/autopkgtest.bPdU1c/build.8Lb/systemd-231/test/networkd-test.py", line 109, in do_test
      subprocess.check_call(['systemctl', 'start', 'systemd-resolved'])
    File "/usr/lib/python3.5/subprocess.py", line 581, in check_call
      raise CalledProcessError(retcode, cmd)
  subprocess.CalledProcessError: Command '['systemctl', 'start', 'systemd-resolved']' returned non-zero exit status 1

  ======================================================================
  ERROR: test_route_only_dns (__main__.DnsmasqClientTest)
  ----------------------------------------------------------------------
  Traceback (most recent call last):
    File "/tmp/autopkgtest.bPdU1c/build.8Lb/systemd-231/test/networkd-test.py", line 79, in tearDown
      self.shutdown_iface()
    File "/tmp/autopkgtest.bPdU1c/build.8Lb/systemd-231/test/networkd-test.py", line 294, in shutdown_iface
      subprocess.check_call(['ip', 'link', 'del', 'dev', self.if_router])
    File "/usr/lib/python3.5/subprocess.py", line 581, in check_call
      raise CalledProcessError(retcode, cmd)
  subprocess.CalledProcessError: Command '['ip', 'link', 'del', 'dev', 'router_eth42']' returned non-zero exit status 1

  ======================================================================
  ERROR: test_coldplug_dhcp_ip4_only (__main__.NetworkdClientTest)
  ----------------------------------------------------------------------
  Traceback (most recent call last):
    File "/tmp/autopkgtest.bPdU1c/build.8Lb/systemd-231/test/networkd-test.py", line 210, in test_coldplug_dhcp_ip4_only
      online_timeout=15)
    File "/tmp/autopkgtest.bPdU1c/build.8Lb/systemd-231/test/networkd-test.py", line 109, in do_test
      subprocess.check_call(['systemctl', 'start', 'systemd-resolved'])
    File "/usr/lib/python3.5/subprocess.py", line 581, in check_call
      raise CalledProcessError(retcode, cmd)
  subprocess.CalledProcessError: Command '['systemctl', 'start', 'systemd-resolved']' returned non-zero exit status 1

  ======================================================================
  ERROR: test_coldplug_dhcp_ip4_only (__main__.NetworkdClientTest)
  ----------------------------------------------------------------------
  Traceback (most recent call last):
    File "/tmp/autopkgtest.bPdU1c/build.8Lb/systemd-231/test/networkd-test.py", line 79, in tearDown
      self.shutdown_iface()
    File "/tmp/autopkgtest.bPdU1c/build.8Lb/systemd-231/test/networkd-test.py", line 377, in shutdown_iface
      subprocess.check_call(['systemctl', 'stop', 'networkd-test-router.service'])
    File "/usr/lib/python3.5/subprocess.py", line 581, in check_call
      raise CalledProcessError(retcode, cmd)
  subprocess.CalledProcessError: Command '['systemctl', 'stop', 'networkd-test-router.service']' returned non-zero exit status 5

  ======================================================================
  ERROR: test_coldplug_dhcp_ip4_only_no_ra (__main__.NetworkdClientTest)
  ----------------------------------------------------------------------
  Traceback (most recent call last):
    File "/tmp/autopkgtest.bPdU1c/build.8Lb/systemd-231/test/networkd-test.py", line 215, in test_coldplug_dhcp_ip4_only_no_ra
      extra_opts='IPv6AcceptRA=False')
    File "/tmp/autopkgtest.bPdU1c/build.8Lb/systemd-231/test/networkd-test.py", line 109, in do_test
      subprocess.check_call(['systemctl', 'start', 'systemd-resolved'])
    File "/usr/lib/python3.5/subprocess.py", line 581, in check_call
      raise CalledProcessError(retcode, cmd)
  subprocess.CalledProcessError: Command '['systemctl', 'start', 'systemd-resolved']' returned non-zero exit status 1

  ======================================================================
  ERROR: test_coldplug_dhcp_ip4_only_no_ra (__main__.NetworkdClientTest)
  ----------------------------------------------------------------------
  Traceback (most recent call last):
    File "/tmp/autopkgtest.bPdU1c/build.8Lb/systemd-231/test/networkd-test.py", line 79, in tearDown
      self.shutdown_iface()
    File "/tmp/autopkgtest.bPdU1c/build.8Lb/systemd-231/test/networkd-test.py", line 377, in shutdown_iface
      subprocess.check_call(['systemctl', 'stop', 'networkd-test-router.service'])
    File "/usr/lib/python3.5/subprocess.py", line 581, in check_call
      raise CalledProcessError(retcode, cmd)
  subprocess.CalledProcessError: Command '['systemctl', 'stop', 'networkd-test-router.service']' returned non-zero exit status 5

  ======================================================================
  ERROR: test_coldplug_dhcp_yes_ip4 (__main__.NetworkdClientTest)
  ----------------------------------------------------------------------
  Traceback (most recent call last):
    File "/tmp/autopkgtest.bPdU1c/build.8Lb/systemd-231/test/networkd-test.py", line 200, in test_coldplug_dhcp_yes_ip4
      self.do_test(coldplug=True, ipv6=False, online_timeout=15)
    File "/tmp/autopkgtest.bPdU1c/build.8Lb/systemd-231/test/networkd-test.py", line 109, in do_test
      subprocess.check_call(['systemctl', 'start', 'systemd-resolved'])
    File "/usr/lib/python3.5/subprocess.py", line 581, in check_call
      raise CalledProcessError(retcode, cmd)
  subprocess.CalledProcessError: Command '['systemctl', 'start', 'systemd-resolved']' returned non-zero exit status 1

  ======================================================================
  ERROR: test_coldplug_dhcp_yes_ip4 (__main__.NetworkdClientTest)
  ----------------------------------------------------------------------
  Traceback (most recent call last):
    File "/tmp/autopkgtest.bPdU1c/build.8Lb/systemd-231/test/networkd-test.py", line 79, in tearDown
      self.shutdown_iface()
    File "/tmp/autopkgtest.bPdU1c/build.8Lb/systemd-231/test/networkd-test.py", line 377, in shutdown_iface
      subprocess.check_call(['systemctl', 'stop', 'networkd-test-router.service'])
    File "/usr/lib/python3.5/subprocess.py", line 581, in check_call
      raise CalledProcessError(retcode, cmd)
  subprocess.CalledProcessError: Command '['systemctl', 'stop', 'networkd-test-router.service']' returned non-zero exit status 5

  ======================================================================
  ERROR: test_coldplug_dhcp_yes_ip4_no_ra (__main__.NetworkdClientTest)
  ----------------------------------------------------------------------
  Traceback (most recent call last):
    File "/tmp/autopkgtest.bPdU1c/build.8Lb/systemd-231/test/networkd-test.py", line 205, in test_coldplug_dhcp_yes_ip4_no_ra
      extra_opts='IPv6AcceptRA=False')
    File "/tmp/autopkgtest.bPdU1c/build.8Lb/systemd-231/test/networkd-test.py", line 109, in do_test
      subprocess.check_call(['systemctl', 'start', 'systemd-resolved'])
    File "/usr/lib/python3.5/subprocess.py", line 581, in check_call
      raise CalledProcessError(retcode, cmd)
  subprocess.CalledProcessError: Command '['systemctl', 'start', 'systemd-resolved']' returned non-zero exit status 1

  ======================================================================
  ERROR: test_coldplug_dhcp_yes_ip4_no_ra (__main__.NetworkdClientTest)
  ----------------------------------------------------------------------
  Traceback (most recent call last):
    File "/tmp/autopkgtest.bPdU1c/build.8Lb/systemd-231/test/networkd-test.py", line 79, in tearDown
      self.shutdown_iface()
    File "/tmp/autopkgtest.bPdU1c/build.8Lb/systemd-231/test/networkd-test.py", line 377, in shutdown_iface
      subprocess.check_call(['systemctl', 'stop', 'networkd-test-router.service'])
    File "/usr/lib/python3.5/subprocess.py", line 581, in check_call
      raise CalledProcessError(retcode, cmd)
  subprocess.CalledProcessError: Command '['systemctl', 'stop', 'networkd-test-router.service']' returned non-zero exit status 5

  ======================================================================
  ERROR: test_hotplug_dhcp_ip4 (__main__.NetworkdClientTest)
  ----------------------------------------------------------------------
  Traceback (most recent call last):
    File "/tmp/autopkgtest.bPdU1c/build.8Lb/systemd-231/test/networkd-test.py", line 222, in test_hotplug_dhcp_ip4
      self.do_test(coldplug=False, ipv6=False, online_timeout=15)
    File "/tmp/autopkgtest.bPdU1c/build.8Lb/systemd-231/test/networkd-test.py", line 109, in do_test
      subprocess.check_call(['systemctl', 'start', 'systemd-resolved'])
    File "/usr/lib/python3.5/subprocess.py", line 581, in check_call
      raise CalledProcessError(retcode, cmd)
  subprocess.CalledProcessError: Command '['systemctl', 'start', 'systemd-resolved']' returned non-zero exit status 1

  ======================================================================
  ERROR: test_hotplug_dhcp_ip4 (__main__.NetworkdClientTest)
  ----------------------------------------------------------------------
  Traceback (most recent call last):
    File "/tmp/autopkgtest.bPdU1c/build.8Lb/systemd-231/test/networkd-test.py", line 79, in tearDown
      self.shutdown_iface()
    File "/tmp/autopkgtest.bPdU1c/build.8Lb/systemd-231/test/networkd-test.py", line 377, in shutdown_iface
      subprocess.check_call(['systemctl', 'stop', 'networkd-test-router.service'])
    File "/usr/lib/python3.5/subprocess.py", line 581, in check_call
      raise CalledProcessError(retcode, cmd)
  subprocess.CalledProcessError: Command '['systemctl', 'stop', 'networkd-test-router.service']' returned non-zero exit status 5

  ======================================================================
  ERROR: test_route_only_dns (__main__.NetworkdClientTest)
  ----------------------------------------------------------------------
  Traceback (most recent call last):
    File "/tmp/autopkgtest.bPdU1c/build.8Lb/systemd-231/test/networkd-test.py", line 244, in test_route_only_dns
      extra_opts='IPv6AcceptRouterAdvertisements=False')
    File "/tmp/autopkgtest.bPdU1c/build.8Lb/systemd-231/test/networkd-test.py", line 109, in do_test
      subprocess.check_call(['systemctl', 'start', 'systemd-resolved'])
    File "/usr/lib/python3.5/subprocess.py", line 581, in check_call
      raise CalledProcessError(retcode, cmd)
  subprocess.CalledProcessError: Command '['systemctl', 'start', 'systemd-resolved']' returned non-zero exit status 1

  ======================================================================
  ERROR: test_route_only_dns (__main__.NetworkdClientTest)
  ----------------------------------------------------------------------
  Traceback (most recent call last):
    File "/tmp/autopkgtest.bPdU1c/build.8Lb/systemd-231/test/networkd-test.py", line 79, in tearDown
      self.shutdown_iface()
    File "/tmp/autopkgtest.bPdU1c/build.8Lb/systemd-231/test/networkd-test.py", line 377, in shutdown_iface
      subprocess.check_call(['systemctl', 'stop', 'networkd-test-router.service'])
    File "/usr/lib/python3.5/subprocess.py", line 581, in check_call
      raise CalledProcessError(retcode, cmd)
  subprocess.CalledProcessError: Command '['systemctl', 'stop', 'networkd-test-router.service']' returned non-zero exit status 5

  ======================================================================
  FAIL: test_search_domains (__main__.NetworkdClientTest)
  ----------------------------------------------------------------------
  Traceback (most recent call last):
    File "/tmp/autopkgtest.bPdU1c/build.8Lb/systemd-231/test/networkd-test.py", line 424, in test_search_domains
      self.assertRegex(contents, 'search .*one two three four')
  AssertionError: Regex didn't match: 'search .*one two three four' not found in '# This file is managed by systemd-resolved(8). Do not edit.\n#\n# This is a dynamic resolv.conf file for connecting local clients directly to\n# all known DNS servers.\n#\n# Third party programs must not access this file directly, but only through the\n# symlink at /etc/resolv.conf. To manage resolv.conf(5) in a different way,\n# replace this symlink by a static file or a different symlink.\n#\n# See systemd-resolved.service(8) for details about the supported modes of\n# operation for /etc/resolv.conf.\n\nnameserver 10.189.73.1\nnameserver 91.189.91.130\nnameserver 91.189.94.2\nsearch openstacklocal\n'

  ======================================================================
  FAIL: test_search_domains_too_long (__main__.NetworkdClientTest)
  ----------------------------------------------------------------------
  Traceback (most recent call last):
    File "/tmp/autopkgtest.bPdU1c/build.8Lb/systemd-231/test/networkd-test.py", line 461, in test_search_domains_too_long
      self.assertRegex(contents, 'search .*%(p)s0 %(p)s1 %(p)s2' % {'p': name_prefix})
  AssertionError: Regex didn't match: 'search .*aaaaaaaaaaaaaaaaaaaaaaaaaaaaaaaaaaaaaaaaaaaaaaaaaaaaaaaaaaaa0 aaaaaaaaaaaaaaaaaaaaaaaaaaaaaaaaaaaaaaaaaaaaaaaaaaaaaaaaaaaa1 aaaaaaaaaaaaaaaaaaaaaaaaaaaaaaaaaaaaaaaaaaaaaaaaaaaaaaaaaaaa2' not found in '# This file is managed by systemd-resolved(8). Do not edit.\n#\n# This is a dynamic resolv.conf file for connecting local clients directly to\n# all known DNS servers.\n#\n# Third party programs must not access this file directly, but only through the\n# symlink at /etc/resolv.conf. To manage resolv.conf(5) in a different way,\n# replace this symlink by a static file or a different symlink.\n#\n# See systemd-resolved.service(8) for details about the supported modes of\n# operation for /etc/resolv.conf.\n\nnameserver 10.189.73.1\nnameserver 91.189.91.130\nnameserver 91.189.94.2\nsearch openstacklocal\n'

  ----------------------------------------------------------------------
  Ran 18 tests in 10.543s

  FAILED (failures=2, errors=28, skipped=2)
  autopkgtest [17:41:26]: test networkd-test.py: -----------------------]
  autopkgtest [17:41:26]: test networkd-test.py:  - - - - - - - - - - results - - - - - - - - - -
  networkd-test.py     FAIL non-zero exit status 1
  autopkgtest [17:41:27]: test networkd-test.py:  - - - - - - - - - - stderr - - - - - - - - - -
  Cannot find device "router_eth42"
  Cannot find device "router_eth42"
  Cannot find device "router_eth42"
  Cannot find device "router_eth42"
  Cannot find device "router_eth42"
  Cannot find device "router_eth42"
  Cannot find device "router_eth42"
  Cannot find device "router_eth42"
  autopkgtest [17:41:27]: test build-login: preparing testbed
  Reading package lists...
  Building dependency tree...
  Reading state information...
  Correcting dependencies...Starting pkgProblemResolver with broken count: 0

  
  https://objectstorage.prodstack4-5.canonical.com/v1/AUTH_77e2ada1e7a84929a74ba3b87153c0ac/autopkgtest-yakkety/yakkety/ppc64el/s/systemd/20160803_182015@/log.gz

To manage notifications about this bug go to:
https://bugs.launchpad.net/ubuntu/+source/systemd/+bug/1609740/+subscriptions



More information about the foundations-bugs mailing list