[Bug 1574104] [NEW] grub-install: error: cannot find EFI directory. package shim-signed 1.12+0.8-0ubuntu2 failed to install/upgrade: subprocess installed post-installation script returned error exit status 1

telseth 1574104 at bugs.launchpad.net
Sat Apr 23 20:01:53 UTC 2016


Public bug reported:

Setting up shim-signed (1.12+0.8-0ubuntu2) ...
Installing for x86_64-efi platform.
grub-install: error: cannot find EFI directory.
dpkg: error processing package shim-signed (--configure):
 subprocess installed post-installation script returned error exit status 1
Errors were encountered while processing:
 shim-signed

ProblemType: Package
DistroRelease: Ubuntu 16.04
Package: shim-signed 1.12+0.8-0ubuntu2
ProcVersionSignature: Ubuntu 4.2.0-35.40-generic 4.2.8-ckt5
Uname: Linux 4.2.0-35-generic x86_64
ApportVersion: 2.20.1-0ubuntu2
Architecture: amd64
BootEFIContents:
 fw
 fwupx64.efi
Date: Sat Apr 23 08:57:34 2016
ErrorMessage: subprocess installed post-installation script returned error exit status 1
InstallationDate: Installed on 2014-12-17 (493 days ago)
InstallationMedia: Ubuntu 14.10 "Utopic Unicorn" - Release amd64 (20141022.1)
RelatedPackageVersions:
 dpkg 1.18.4ubuntu1
 apt  1.2.10ubuntu1
SourcePackage: shim-signed
Title: package shim-signed 1.12+0.8-0ubuntu2 failed to install/upgrade: subprocess installed post-installation script returned error exit status 1
UpgradeStatus: Upgraded to xenial on 2016-04-23 (0 days ago)

** Affects: shim-signed (Ubuntu)
     Importance: Undecided
         Status: New


** Tags: amd64 apport-package xenial

-- 
You received this bug notification because you are a member of Ubuntu
Foundations Bugs, which is subscribed to shim-signed in Ubuntu.
https://bugs.launchpad.net/bugs/1574104

Title:
  grub-install: error: cannot find EFI directory. package shim-signed
  1.12+0.8-0ubuntu2 failed to install/upgrade: subprocess installed
  post-installation script returned error exit status 1

Status in shim-signed package in Ubuntu:
  New

Bug description:
  Setting up shim-signed (1.12+0.8-0ubuntu2) ...
  Installing for x86_64-efi platform.
  grub-install: error: cannot find EFI directory.
  dpkg: error processing package shim-signed (--configure):
   subprocess installed post-installation script returned error exit status 1
  Errors were encountered while processing:
   shim-signed

  ProblemType: Package
  DistroRelease: Ubuntu 16.04
  Package: shim-signed 1.12+0.8-0ubuntu2
  ProcVersionSignature: Ubuntu 4.2.0-35.40-generic 4.2.8-ckt5
  Uname: Linux 4.2.0-35-generic x86_64
  ApportVersion: 2.20.1-0ubuntu2
  Architecture: amd64
  BootEFIContents:
   fw
   fwupx64.efi
  Date: Sat Apr 23 08:57:34 2016
  ErrorMessage: subprocess installed post-installation script returned error exit status 1
  InstallationDate: Installed on 2014-12-17 (493 days ago)
  InstallationMedia: Ubuntu 14.10 "Utopic Unicorn" - Release amd64 (20141022.1)
  RelatedPackageVersions:
   dpkg 1.18.4ubuntu1
   apt  1.2.10ubuntu1
  SourcePackage: shim-signed
  Title: package shim-signed 1.12+0.8-0ubuntu2 failed to install/upgrade: subprocess installed post-installation script returned error exit status 1
  UpgradeStatus: Upgraded to xenial on 2016-04-23 (0 days ago)

To manage notifications about this bug go to:
https://bugs.launchpad.net/ubuntu/+source/shim-signed/+bug/1574104/+subscriptions



More information about the foundations-bugs mailing list