[Bug 1569434] [NEW] adt-run fails with "dpkg-genchanges: error: cannot read ../akonadi_15.12.1-0ubuntu4.dsc: No such file or directory"
Robie Basak
1569434 at bugs.launchpad.net
Tue Apr 12 16:02:40 UTC 2016
Public bug reported:
Steps to reproduce:
Install autopkgtest 3.20.3 on Xenial.
adt-buildvm-ubuntu-cloud -r xenial
pull-lp-source -d akonadi
adt-run -oadt --apt-pocket=proposed -U akonadi_15.12.1-0ubuntu3.dsc --- adt-virt-qemu ~/adt-xenial-amd64-cloud.img
Note: I used ubuntu4 since that is my proposed upload. My change is just
to do s/5.6/5.7/ in debian/control, so I think that is unrelated to this
issue.
The error was:
dpkg-deb: building package 'akonadi-backend-sqlite' in '../akonadi-backend-sqlite_15.12.1-0ubuntu4_amd64.deb'.
dpkg-deb: building package 'akonadi-dbg' in '../akonadi-dbg_15.12.1-0ubuntu4_amd64.deb'.
=== Start list-missing
=== End list-missing
dpkg-genchanges > ../.pkg-kde-lintian.changes
dpkg-genchanges: error: cannot read ../akonadi_15.12.1-0ubuntu4.dsc: No such file or directory
/usr/share/pkg-kde-tools/qt-kde-team/3/lintian.mk:20: recipe for target 'lintian' failed
make[1]: *** [lintian] Error 2
make[1]: Leaving directory '/tmp/adt-run.rhiFtm/build.N6U/akonadi-15.12.1'
/usr/share/pkg-kde-tools/qt-kde-team/3/dhmk.mk:112: recipe for target 'debian/dhmk_binary' failed
make: *** [debian/dhmk_binary] Error 2
dpkg-buildpackage: error: fakeroot debian/rules binary gave error exit status 2
blame: akonadi_15.12.1-0ubuntu4.dsc
badpkg: rules build failed with exit code 2
adt-run [15:48:08]: ERROR: erroneous package: rules build failed with exit code 2
qemu-system-x86_64: terminating on signal 15 from pid 7829
Full log at: http://paste.ubuntu.com/15794227/
** Affects: autopkgtest (Ubuntu)
Importance: Undecided
Status: New
--
You received this bug notification because you are a member of Ubuntu
Foundations Bugs, which is subscribed to autopkgtest in Ubuntu.
https://bugs.launchpad.net/bugs/1569434
Title:
adt-run fails with "dpkg-genchanges: error: cannot read
../akonadi_15.12.1-0ubuntu4.dsc: No such file or directory"
Status in autopkgtest package in Ubuntu:
New
Bug description:
Steps to reproduce:
Install autopkgtest 3.20.3 on Xenial.
adt-buildvm-ubuntu-cloud -r xenial
pull-lp-source -d akonadi
adt-run -oadt --apt-pocket=proposed -U akonadi_15.12.1-0ubuntu3.dsc --- adt-virt-qemu ~/adt-xenial-amd64-cloud.img
Note: I used ubuntu4 since that is my proposed upload. My change is
just to do s/5.6/5.7/ in debian/control, so I think that is unrelated
to this issue.
The error was:
dpkg-deb: building package 'akonadi-backend-sqlite' in '../akonadi-backend-sqlite_15.12.1-0ubuntu4_amd64.deb'.
dpkg-deb: building package 'akonadi-dbg' in '../akonadi-dbg_15.12.1-0ubuntu4_amd64.deb'.
=== Start list-missing
=== End list-missing
dpkg-genchanges > ../.pkg-kde-lintian.changes
dpkg-genchanges: error: cannot read ../akonadi_15.12.1-0ubuntu4.dsc: No such file or directory
/usr/share/pkg-kde-tools/qt-kde-team/3/lintian.mk:20: recipe for target 'lintian' failed
make[1]: *** [lintian] Error 2
make[1]: Leaving directory '/tmp/adt-run.rhiFtm/build.N6U/akonadi-15.12.1'
/usr/share/pkg-kde-tools/qt-kde-team/3/dhmk.mk:112: recipe for target 'debian/dhmk_binary' failed
make: *** [debian/dhmk_binary] Error 2
dpkg-buildpackage: error: fakeroot debian/rules binary gave error exit status 2
blame: akonadi_15.12.1-0ubuntu4.dsc
badpkg: rules build failed with exit code 2
adt-run [15:48:08]: ERROR: erroneous package: rules build failed with exit code 2
qemu-system-x86_64: terminating on signal 15 from pid 7829
Full log at: http://paste.ubuntu.com/15794227/
To manage notifications about this bug go to:
https://bugs.launchpad.net/ubuntu/+source/autopkgtest/+bug/1569434/+subscriptions
More information about the foundations-bugs
mailing list