[Bug 1451528] [NEW] lintian fails to build in trusty (test failure)

Matthias Klose doko at ubuntu.com
Mon May 4 18:28:50 UTC 2015


Public bug reported:

seen in a test rebuild and a plain build on the i386 porter box

Running legacy-relations 5... building... testing... ok.
Running legacy-scripts 6ds-1ubuntu0.5.10.1... building... testing... ok.
Running legacy-libbaz 1-1... building... testing... ok.

Skipped/disabled tests:
  [debs]
    deb-format-wrong-order: Missing Depends: dpkg (<< 1.17.2)
  [tests]
    runtests-arch-amd64: architecture mismatch

Failed tests (1)
    binaries-from-other-arch
make: *** [runtests] Error 1
dpkg-buildpackage: error: debian/rules build gave error exit status 2

** Affects: lintian (Ubuntu)
     Importance: High
         Status: Confirmed


** Tags: ftbfs

-- 
You received this bug notification because you are a member of Ubuntu
Foundations Bugs, which is subscribed to lintian in Ubuntu.
https://bugs.launchpad.net/bugs/1451528

Title:
  lintian fails to build in trusty (test failure)

Status in lintian package in Ubuntu:
  Confirmed

Bug description:
  seen in a test rebuild and a plain build on the i386 porter box

  Running legacy-relations 5... building... testing... ok.
  Running legacy-scripts 6ds-1ubuntu0.5.10.1... building... testing... ok.
  Running legacy-libbaz 1-1... building... testing... ok.

  Skipped/disabled tests:
    [debs]
      deb-format-wrong-order: Missing Depends: dpkg (<< 1.17.2)
    [tests]
      runtests-arch-amd64: architecture mismatch

  Failed tests (1)
      binaries-from-other-arch
  make: *** [runtests] Error 1
  dpkg-buildpackage: error: debian/rules build gave error exit status 2

To manage notifications about this bug go to:
https://bugs.launchpad.net/ubuntu/+source/lintian/+bug/1451528/+subscriptions



More information about the foundations-bugs mailing list