[Bug 1434756] Re: package friendly-recovery 0.2.25 failed to install/upgrade: ErrorMessage: subprocess installed post-installation script returned error exit status 1
Brian Murray
brian at ubuntu.com
Tue Mar 31 19:28:15 UTC 2015
Here's the error message:
Setting up friendly-recovery (0.2.25) ...^M
Generating grub.cfg ...^M
/usr/sbin/grub-probe: error: failed to get canonical path of /boot/grub/locale.^M
/usr/sbin/grub-probe: error: cannot stat `'.^M
dpkg: error processing friendly-recovery (--configure):^M
subprocess installed post-installation script returned error exit status 1^M
--
You received this bug notification because you are a member of Ubuntu
Foundations Bugs, which is subscribed to friendly-recovery in Ubuntu.
https://bugs.launchpad.net/bugs/1434756
Title:
package friendly-recovery 0.2.25 failed to install/upgrade:
ErrorMessage: subprocess installed post-installation script returned
error exit status 1
Status in friendly-recovery package in Ubuntu:
New
Bug description:
package friendly-recovery 0.2.25
ProblemType: Package
DistroRelease: Ubuntu 12.04
Package: friendly-recovery 0.2.25
ProcVersionSignature: Ubuntu 3.0.0-16.29-generic 3.0.20
Uname: Linux 3.0.0-16-generic i686
ApportVersion: 2.0.1-0ubuntu5
Architecture: i386
Date: Thu Apr 19 14:13:30 2012
ErrorMessage: ErrorMessage: subprocess installed post-installation script returned error exit status 127
InstallationMedia: Ubuntu 10.04
elease i386 (20111012)
PackageArchitecture: all
Sour...
ProblemType: Package
DistroRelease: Ubuntu 12.04
Package: friendly-recovery 0.2.25
ProcVersionSignature: Ubuntu 3.2.0-77.114-generic 3.2.66
Uname: Linux 3.2.0-77-generic i686
ApportVersion: 2.0.1-0ubuntu17.8
Architecture: i386
Date: Fri Mar 20 21:15:44 2015
ErrorMessage: ErrorMessage: subprocess installed post-installation script returned error exit status 1
InstallationMedia: Ubuntu 10.04.1 LTS "Lucid Lynx" - Release i386 (20100816.1)
MarkForUpload: True
PackageArchitecture: all
SourcePackage: friendly-recovery
Title: package friendly-recovery 0.2.25 failed to install/upgrade: ErrorMessage: subprocess installed post-installation script returned error exit status 1
UpgradeStatus: Upgraded to precise on 2015-03-21 (0 days ago)
To manage notifications about this bug go to:
https://bugs.launchpad.net/ubuntu/+source/friendly-recovery/+bug/1434756/+subscriptions
More information about the foundations-bugs
mailing list