[Bug 1425005] Re: Syntax error in file
Brian Murray
brian at ubuntu.com
Tue Feb 24 21:49:11 UTC 2015
*** This bug is a duplicate of bug 1424814 ***
https://bugs.launchpad.net/bugs/1424814
** This bug has been marked a duplicate of bug 1424814
package python3-distupgrade 1:15.04.8 failed to install/upgrade: Unterprozess installiertes post-installation-Skript gab den Fehlerwert 1 zurück
--
You received this bug notification because you are a member of Ubuntu
Foundations Bugs, which is subscribed to ubuntu-release-upgrader in
Ubuntu.
https://bugs.launchpad.net/bugs/1425005
Title:
Syntax error in file
Status in ubuntu-release-upgrader package in Ubuntu:
New
Bug description:
Setting up python3-distupgrade (1:15.04.8) ...
File "/usr/lib/python3/dist-packages/DistUpgrade/DistUpgradeViewKDE.py", line 37
from PyQt5.QtGui import QTextOption, QPixmap, QIcon,
^
SyntaxError: trailing comma not allowed without surrounding parentheses
dpkg: error processing package python3-distupgrade (--configure):
subprocess installed post-installation script returned error exit status 1
dpkg: dependency problems prevent configuration of python3-update-manager:
python3-update-manager depends on python3-distupgrade; however:
Package python3-distupgrade is not configured yet.
dpkg: error processing package python3-update-manager (--configure):
dependency problems - leaving unconfigured
dpkg: dependency problems prevent configuration of ubuntu-release-upgrader-core:
ubuntu-release-upgrader-core depends on python3-distupgrade (= 1:15.04.8); however:
Package python3-distupgrade is not configured yet.
dpkg: error processing package ubuntu-release-upgrader-core (--configure):
dependency problems - leaving unconfigured
dpkg: dependency problems prevent configuration of update-manager-core:
update-manager-core depends on python3-update-manager (= 1:15.04.2); however:
Package python3-update-manager is not configured yet.
update-manager-core depends on ubuntu-release-upgrader-core; however:
Package ubuntu-release-upgrader-core is not configured yet.
dpkg: error processNo apport report written because the error message indicates its a followup error from a previous failure.
No apport report written because the error message indicates its a followup error from a previous failure.
No apport report written because MaxReports is reached already
No apport report written because MaxReports is reached already
No apport report written because MaxReports is reached already
No apport report written because MaxReports is reached already
ing package update-manager-core (--configure):
dependency problems - leaving unconfigured
dpkg: dependency problems prevent configuration of update-manager:
update-manager depends on update-manager-core (= 1:15.04.2); however:
Package update-manager-core is not configured yet.
dpkg: error processing package update-manager (--configure):
dependency problems - leaving unconfigured
dpkg: dependency problems prevent configuration of ubuntu-release-upgrader-gtk:
ubuntu-release-upgrader-gtk depends on ubuntu-release-upgrader-core (= 1:15.04.8); however:
Package ubuntu-release-upgrader-core is not configured yet.
ubuntu-release-upgrader-gtk depends on python3-distupgrade (= 1:15.04.8); however:
Package python3-distupgrade is not configured yet.
dpkg: error processing package ubuntu-release-upgrader-gtk (--configure):
dependency problems - leaving unconfigured
dpkg: dependency problems prevent configuration of update-notifier:
update-notifier depends on update-manager-gnome | update-manager (>= 1:0.165); however:
Package update-manager-gnome is not installed.
Package update-manager is not configured yet.
update-notifier depends on ubuntu-release-upgrader-gtk; however:
Package ubuntu-release-upgrader-gtk is not configured yet.
dpkg: error processing package update-notifier (--configure):
dependency problems - leaving unconfigured
dpkg: dependency problems prevent configuration of ubuntu-release-upgrader-qt:
ubuntu-release-upgrader-qt depends on ubuntu-release-upgrader-core (= 1:15.04.8); however:
Package ubuntu-release-upgrader-core is not configured yet.
dpkg: error processing package ubuntu-release-upgrader-qt (--configure):
dependency problems - leaving unconfigured
No apport report written because MaxReports is reached already
Errors were encountered while processing:
python3-distupgrade
python3-update-manager
ubuntu-release-upgrader-core
update-manager-core
update-manager
ubuntu-release-upgrader-gtk
update-notifier
ubuntu-release-upgrader-qt
E: Sub-process /usr/bin/dpkg returned an error code (1)
ProblemType: Bug
DistroRelease: Ubuntu 15.04
Package: python3-distupgrade 1:15.04.8
ProcVersionSignature: Ubuntu 3.18.0-11.12-generic 3.18.3
Uname: Linux 3.18.0-11-generic i686
ApportVersion: 2.16.1-0ubuntu2
Architecture: i386
CrashDB: ubuntu
CurrentDesktop: GNOME
Date: Tue Feb 24 11:22:56 2015
InstallationDate: Installed on 2014-12-30 (55 days ago)
InstallationMedia: Ubuntu-GNOME 14.10 "Utopic Unicorn" - Alpha i386 (20140630)
PackageArchitecture: all
ProcEnviron:
TERM=xterm
PATH=(custom, no user)
XDG_RUNTIME_DIR=<set>
LANG=en_US.UTF-8
SHELL=/bin/bash
SourcePackage: ubuntu-release-upgrader
UpgradeStatus: No upgrade log present (probably fresh install)
VarLogDistupgradeAptHistorylog:
Start-Date: 2015-01-28 10:13:10
End-Date: 2015-01-28 10:13:10
VarLogDistupgradeAptlog:
Log time: 2015-01-28 10:12:53.111874
Starting pkgProblemResolver with broken count: 0
Starting 2 pkgProblemResolver with broken count: 0
Done
Log time: 2015-01-28 10:13:11.812662
VarLogDistupgradeApttermlog:
Log started: 2015-01-28 10:13:10
Log ended: 2015-01-28 10:13:10
To manage notifications about this bug go to:
https://bugs.launchpad.net/ubuntu/+source/ubuntu-release-upgrader/+bug/1425005/+subscriptions
More information about the foundations-bugs
mailing list