[Bug 908035] Re: package mutt 1.5.20-7ubuntu1.1 failed to install/upgrade: error writing to '<standard output>': Input/output error
dino99
908035 at bugs.launchpad.net
Sat Dec 26 15:03:11 UTC 2015
This version has expired some times ago, and no backport is expected as
there is no 'security' reported problem
** Changed in: mutt (Ubuntu)
Status: New => Invalid
--
You received this bug notification because you are a member of Ubuntu
Foundations Bugs, which is subscribed to mutt in Ubuntu.
https://bugs.launchpad.net/bugs/908035
Title:
package mutt 1.5.20-7ubuntu1.1 failed to install/upgrade: error
writing to '<standard output>': Input/output error
Status in mutt package in Ubuntu:
Invalid
Bug description:
failed to install.
X broken.
ProblemType: Package
DistroRelease: Ubuntu 10.04
Package: mutt 1.5.20-7ubuntu1.1
ProcVersionSignature: Ubuntu 2.6.32-36.79-generic 2.6.32.46+drm33.20
Uname: Linux 2.6.32-36-generic i686
NonfreeKernelModules: wl
AptOrdering:
mutt: Install
postfix: Install
mutt: Configure
postfix: Configure
Architecture: i386
Date: Fri Dec 23 11:19:20 2011
ErrorMessage: error writing to '<standard output>': Input/output error
InstallationMedia: Ubuntu-Netbook 10.04 "Lucid Lynx" - Release i386 (20100429.4)
SourcePackage: mutt
Title: package mutt 1.5.20-7ubuntu1.1 failed to install/upgrade: error writing to '<standard output>': Input/output error
To manage notifications about this bug go to:
https://bugs.launchpad.net/ubuntu/+source/mutt/+bug/908035/+subscriptions
More information about the foundations-bugs
mailing list