[Bug 973903] Re: package linux-image-3.2.0-22-generic-pae 3.2.0-22.35 failed to install/upgrade: run-parts: /etc/kernel/postinst.d/zz-runlilo exited with return code 1
Launchpad Bug Tracker
973903 at bugs.launchpad.net
Sat Oct 18 04:29:03 UTC 2014
** Branch linked: lp:debian/lilo
--
You received this bug notification because you are a member of Ubuntu
Foundations Bugs, which is subscribed to lilo in Ubuntu.
https://bugs.launchpad.net/bugs/973903
Title:
package linux-image-3.2.0-22-generic-pae 3.2.0-22.35 failed to
install/upgrade: run-parts: /etc/kernel/postinst.d/zz-runlilo exited
with return code 1
Status in “lilo” package in Ubuntu:
Incomplete
Bug description:
Setting up linux-image-3.2.0-22-generic-pae (3.2.0-22.35) ...
Running depmod.
update-initramfs: deferring update (hook will be called later)
Examining /etc/kernel/postinst.d.
run-parts: executing /etc/kernel/postinst.d/initramfs-tools 3.2.0-22-generic-pae /boot/vmlinuz-3.2.0-22-generic-pae
update-initramfs: Generating /boot/initrd.img-3.2.0-22-generic-pae
run-parts: executing /etc/kernel/postinst.d/pm-utils 3.2.0-22-generic-pae /boot/vmlinuz-3.2.0-22-generic-pae
run-parts: executing /etc/kernel/postinst.d/update-notifier 3.2.0-22-generic-pae /boot/vmlinuz-3.2.0-22-generic-pae
run-parts: executing /etc/kernel/postinst.d/zz-runlilo 3.2.0-22-generic-pae /boot/vmlinuz-3.2.0-22-generic-pae
Fatal: No images have been defined.
run-parts: /etc/kernel/postinst.d/zz-runlilo exited with return code 1
Failed to process /etc/kernel/postinst.d at /var/lib/dpkg/info/linux-image-3.2.0-22-generic-pae.postinst line 1010.
dpkg: error processing linux-image-3.2.0-22-generic-pae (--configure):
subprocess installed post-installation script returned error exit status 2
dpkg: dependency problems prevent configuration of linux-image-generic-pae:
linux-image-generic-pae depends on linux-image-3.2.0-22-generic-pae; however:
Package linux-image-3.2.0-22-generic-pae is not configured yet.
dpkg: error processing linux-image-generic-pae (--configure):
dependency problems - leaving unconfigured
dpkg: dependency problems prevent configuration of linux-generic-pae:
linux-generic-pae depends on linux-image-generic-pae (= 3.2.0.22.24); however:
Package linux-image-generic-pae is not configured yet.
dpkg: error processing linux-generic-pae (--configure):
dependency problems - leaving unconfigured
No apport report written because the error message indicates its a followup error from a previous failure.
No apport report written because the error message indicates its a followup error from a previous failure.
E: Sub-process /usr/bin/dpkg returned an error code (1)
ProblemType: Package
DistroRelease: Ubuntu 12.04
Package: linux-image-3.2.0-22-generic-pae 3.2.0-22.35
ProcVersionSignature: Ubuntu 3.2.0-21.34-generic-pae 3.2.13
Uname: Linux 3.2.0-21-generic-pae i686
ApportVersion: 2.0-0ubuntu4
Architecture: i386
Date: Wed Apr 4 21:42:12 2012
ErrorMessage: run-parts: /etc/kernel/postinst.d/zz-runlilo exited with return code 1
InstallationMedia: Ubuntu 12.04 LTS "Precise Pangolin" - Alpha i386 (20120122)
SourcePackage: lilo
Title: package linux-image-3.2.0-22-generic-pae 3.2.0-22.35 failed to install/upgrade: run-parts: /etc/kernel/postinst.d/zz-runlilo exited with return code 1
UpgradeStatus: No upgrade log present (probably fresh install)
To manage notifications about this bug go to:
https://bugs.launchpad.net/ubuntu/+source/lilo/+bug/973903/+subscriptions
More information about the foundations-bugs
mailing list