[Bug 1270412] Re: package librpmbuild3 4.11.1-2 failed to install/upgrade: package librpmbuild3 is not ready for configuration cannot configure (current status `half-installed')

sayth 1270412 at bugs.launchpad.net
Mon Mar 31 05:31:42 UTC 2014


sayth at sayth-TravelMate-5740G:~$ sudo apt-get install -f epson-inkjet-printer-201203w
Reading package lists... Done
Building dependency tree       
Reading state information... Done
The following extra packages will be installed:
  alien lsb lsb-core lsb-cxx lsb-desktop lsb-graphics lsb-languages
  lsb-multimedia lsb-printing rpm
Suggested packages:
  lsb-rpm elfutils rpm-i18n
Recommended packages:
  libqt3-mt
The following NEW packages will be installed:
  alien epson-inkjet-printer-201203w lsb lsb-core lsb-cxx lsb-desktop
  lsb-graphics lsb-languages lsb-multimedia lsb-printing rpm
0 to upgrade, 11 to newly install, 0 to remove and 0 not to upgrade.
1 not fully installed or removed.
Need to get 0 B/2,121 kB of archives.
After this operation, 4,271 kB of additional disk space will be used.
Do you want to continue? [Y/n] y
Preconfiguring packages ...
Selecting previously unselected package rpm.
(Reading database ... 191844 files and directories currently installed.)
Preparing to unpack .../rpm_4.11.1-3_amd64.deb ...
Unpacking rpm (4.11.1-3) ...
Selecting previously unselected package alien.
Preparing to unpack .../archives/alien_8.90_all.deb ...
Unpacking alien (8.90) ...
Selecting previously unselected package lsb-core.
Preparing to unpack .../lsb-core_4.1+Debian11ubuntu6_amd64.deb ...
Unpacking lsb-core (4.1+Debian11ubuntu6) ...
Selecting previously unselected package lsb-graphics.
Preparing to unpack .../lsb-graphics_4.1+Debian11ubuntu6_amd64.deb ...
Unpacking lsb-graphics (4.1+Debian11ubuntu6) ...
Selecting previously unselected package lsb-cxx.
Preparing to unpack .../lsb-cxx_4.1+Debian11ubuntu6_amd64.deb ...
Unpacking lsb-cxx (4.1+Debian11ubuntu6) ...
Selecting previously unselected package lsb-multimedia.
Preparing to unpack .../lsb-multimedia_4.1+Debian11ubuntu6_amd64.deb ...
Unpacking lsb-multimedia (4.1+Debian11ubuntu6) ...
Selecting previously unselected package lsb-desktop.
Preparing to unpack .../lsb-desktop_4.1+Debian11ubuntu6_amd64.deb ...
Unpacking lsb-desktop (4.1+Debian11ubuntu6) ...
Selecting previously unselected package lsb-printing.
Preparing to unpack .../lsb-printing_4.1+Debian11ubuntu6_amd64.deb ...
Unpacking lsb-printing (4.1+Debian11ubuntu6) ...
Selecting previously unselected package lsb-languages.
Preparing to unpack .../lsb-languages_4.1+Debian11ubuntu6_amd64.deb ...
Unpacking lsb-languages (4.1+Debian11ubuntu6) ...
Selecting previously unselected package lsb.
Preparing to unpack .../lsb_4.1+Debian11ubuntu6_all.deb ...
Unpacking lsb (4.1+Debian11ubuntu6) ...
Selecting previously unselected package epson-inkjet-printer-201203w.
Preparing to unpack .../epson-inkjet-printer-201203w_1.0.0-1lsb3.2_amd64.deb ...
Unpacking epson-inkjet-printer-201203w (1.0.0-1lsb3.2) ...
Processing triggers for man-db (2.6.6-1) ...
dpkg: error processing package librpmsign1 (--configure):
 package librpmsign1 is not ready for configuration
 cannot configure (current status `half-installed')
dpkg: dependency problems prevent configuration of rpm:
 rpm depends on librpmsign1 (>= 4.10.0); however:
  Package librpmsign1 is not installed.

dpkg: error processing package rpm (--configure):
 dependency problems - leaving unconfigured
dpkg: dependency problems prevent configuration of alien:
 alien depends on rpm (>= 2.4.4-2); however:
  Package rpm is not configured yet.

dpkg: error processing package alien (--configure):
 dependency problems - leaving unconfigured
dpkg: dependency problems prevent configuration of lsb-core:
 lsb-core depends on alien (>= 8.36); however:
  Package alien is not configured yet.

dpkg: error processing package lsb-core (--configure):
 dependency problems - leaving unconfigured
dpkg: dependency problems prevent configuration of lsb-graphics:
 lsb-graphics depends on lsb-core (>= 4.1+Debian11ubuntu6); however:
  Package lsb-core is not configured yet.

dpkg: error processing package lsb-graphics (--configure):
 dependency problems - leaving unconfigured
dpkg: dependency problems prevent configuration ofNo apport report written because the error message indicates its a followup error from a previous failure.
                                                                            No apport report written because the error message indicates its a followup error from a previous failure.
                      No apport report written because MaxReports is reached already
    No apport report written because MaxReports is reached already
                                                                   lsb-cxx:
 lsb-cxx depends on lsb-core (>= 4.1+Debian11ubuntu6); however:
  Package lsb-core is not configured yet.

dpkg: error processing package lsb-cxx (--configure):
 dependency problems - leaving unconfigured
dpkg: dependency problems prevent configuration of lsb-multimedia:
 lsb-multimedia depends on lsb-core (>= 4.1+Debian11ubuntu6); however:
  Package lsb-core is not configured yet.

dpkg: error processing package lsb-multimedia (--configure):
 dependency problems - leaving unconfigured
No apport report written because MaxReports is reached already
                                                              No apport report written because MaxReports is reached already
                                            dpkg: dependency problems prevent configuration of lsb-desktop:
 lsb-desktop depends on lsb-graphics (>= 4.1+Debian11ubuntu6); however:
  Package lsb-graphics is not configured yet.
 lsb-desktop depends on lsb-multimedia (>= 4.1+Debian11ubuntu6); however:
  Package lsb-multimedia is not configured yet.

dpkg: error processing package lsb-desktop (--configure):
 dependency problems - leaving unconfigured
No apport report written because MaxReports is reached already
                                                              dpkg: dependency problems prevent configuration of lsb-printing:
 lsb-printing depends on lsb-core (>= 4.1+Debian11ubuntu6); however:
  Package lsb-core is not configured yet.

dpkg: error processing package lsb-printing (--configure):
 dependency problems - leaving unconfigured
No apport report written because MaxReports is reached already
                                                              dpkg: dependency problems prevent configuration of lsb-languages:
 lsb-languages depends on lsb-core (>= 4.1+Debian11ubuntu6); however:
  Package lsb-core is not configured yet.

dpkg: error processing package lsb-languages (--configure):
 dependency problems - leaving unconfigured
No apport report written because MaxReports is reached already
                                                              dpkg: dependency problems prevent configuration of lsb:
 lsb depends on lsb-core (>= 4.1+Debian11ubuntu6); however:
  Package lsb-core is not configured yet.
 lsb depends on lsb-graphics (>= 4.1+Debian11ubuntu6); however:
  Package lsb-graphics is not configured yet.
 lsb depends on lsb-cxx (>= 4.1+Debian11ubuntu6); however:
  Package lsb-cxx is not configured yet.
 lsb depends on lsb-desktop (>= 4.1+Debian11ubuntu6); however:
  Package lsb-desktop is not configured yet.
 lsb depends on lsb-printing (>= 4.1+Debian11ubuntu6); however:
  Package lsb-printing is not configured yet.
 lsb depends on lsb-languages (>= 4.1+Debian11ubuntu6); however:
  Package lsb-languages is not configured yet.

dpkg: error processing package lsb (--configure):
 dependency problems - leaving unconfigured
dpkg: dependency problems prevent configuration of epson-inkjet-printer-201203w:
 epson-inkjet-printer-201203w depends on lsb (>= 3.2); however:
  Package lsb is not configured yet.
No apport report written because MaxReports is reached already

dpkg: error processing package epson-inkjet-printer-201203w (--configure):
 dependency problems - leaving unconfigured
No apport report written because MaxReports is reached already
                                                              Errors were encountered while processing:
 librpmsign1
 rpm
 alien
 lsb-core
 lsb-graphics
 lsb-cxx
 lsb-multimedia
 lsb-desktop
 lsb-printing
 lsb-languages
 lsb
 epson-inkjet-printer-201203w
E: Sub-process /usr/bin/dpkg returned an error code (1)
sayth at sayth-TravelMate-5740G:~$

-- 
You received this bug notification because you are a member of Ubuntu
Foundations Bugs, which is subscribed to rpm in Ubuntu.
https://bugs.launchpad.net/bugs/1270412

Title:
  package librpmbuild3 4.11.1-2 failed to install/upgrade: package
  librpmbuild3 is not ready for configuration  cannot configure (current
  status `half-installed')

Status in “rpm” package in Ubuntu:
  Incomplete

Bug description:
  It was while installing epson drivers

  ProblemType: Package
  DistroRelease: Ubuntu 13.10
  Package: librpmbuild3 4.11.1-2
  ProcVersionSignature: Ubuntu 3.11.0-15.23-generic 3.11.10
  Uname: Linux 3.11.0-15-generic x86_64
  ApportVersion: 2.12.5-0ubuntu2.2
  AptOrdering:
   ttf-ancient-fonts: Install
   ttf-ancient-fonts: Configure
   intel-linux-graphics-installer: Configure
   librpmbuild3: Configure
  Architecture: amd64
  Date: Sat Jan 18 08:43:21 2014
  DuplicateSignature: package:librpmbuild3:4.11.1-2:package librpmbuild3 is not ready for configuration  cannot configure (current status `half-installed')
  ErrorMessage: package librpmbuild3 is not ready for configuration  cannot configure (current status `half-installed')
  InstallationDate: Installed on 2013-11-16 (62 days ago)
  InstallationMedia: Xubuntu 13.10 "Saucy Salamander" - Release amd64 (20131016)
  MarkForUpload: True
  SourcePackage: rpm
  Title: package librpmbuild3 4.11.1-2 failed to install/upgrade: package librpmbuild3 is not ready for configuration  cannot configure (current status `half-installed')
  UpgradeStatus: No upgrade log present (probably fresh install)

To manage notifications about this bug go to:
https://bugs.launchpad.net/ubuntu/+source/rpm/+bug/1270412/+subscriptions



More information about the foundations-bugs mailing list