[Bug 1293041] Re: package linux-image-3.8.0-37-generic 3.8.0-37.53~precise1 failed to install/upgrade: run-parts: /etc/kernel/postinst.d/initramfs-tools exited with return code 1

Erotavlas erotavlas_turbo at libero.it
Sun Mar 16 14:10:13 UTC 2014


** Changed in: initramfs-tools (Ubuntu)
       Status: Incomplete => Confirmed

** Attachment added: "make.log"
   https://bugs.launchpad.net/ubuntu/+source/initramfs-tools/+bug/1293041/+attachment/4026698/+files/make.log

-- 
You received this bug notification because you are a member of Ubuntu
Foundations Bugs, which is subscribed to initramfs-tools in Ubuntu.
https://bugs.launchpad.net/bugs/1293041

Title:
  package linux-image-3.8.0-37-generic 3.8.0-37.53~precise1 failed to
  install/upgrade: run-parts: /etc/kernel/postinst.d/initramfs-tools
  exited with return code 1

Status in “initramfs-tools” package in Ubuntu:
  Confirmed

Bug description:
  During the updating of kernel in Ubuntu 12.04 64 bit.

  Setting up linux-image-3.11.0-17-generic (3.11.0-17.31~precise1) ...
  Running depmod.
  update-initramfs: deferring update (hook will be called later)
  The link /initrd.img is a dangling linkto /boot/initrd.img-3.11.0-18-generic
  Examining /etc/kernel/postinst.d.
  run-parts: executing /etc/kernel/postinst.d/apt-auto-removal 3.11.0-17-generic /boot/vmlinuz-3.11.0-17-generic
  run-parts: executing /etc/kernel/postinst.d/dkms 3.11.0-17-generic /boot/vmlinuz-3.11.0-17-generic
  Error! Bad return status for module build on kernel: 3.11.0-17-generic (x86_64)
  Consult /var/lib/dkms/nvidia-current/319.37/build/make.log for more information.
  run-parts: executing /etc/kernel/postinst.d/initramfs-tools 3.11.0-17-generic /boot/vmlinuz-3.11.0-17-generic
  update-initramfs: Generating /boot/initrd.img-3.11.0-17-generic
  E: /usr/share/initramfs-tools/hooks/fuse failed with return 1.
  update-initramfs: failed for /boot/initrd.img-3.11.0-17-generic with 1.
  run-parts: /etc/kernel/postinst.d/initramfs-tools exited with return code 1
  Failed to process /etc/kernel/postinst.d at /var/lib/dpkg/info/linux-image-3.11.0-17-generic.postinst line 1010.
  dpkg: error processing linux-image-3.11.0-17-generic (--configure):
   subprocess installed post-installation script returned error exit status 2
  Setting up linux-image-3.11.0-18-generic (3.11.0-18.32~precise1) ...
  Running depmod.
  update-initramfs: deferring update (hook will be called later)
  The link /initrd.img is a dangling linkto /boot/initrd.img-3.11.0-17-generic
  Examining /etc/kernel/postinst.d.
  run-parts: executing /etc/kernel/postinst.d/apt-auto-removal 3.11.0-18-generic /boot/vmlinuz-3.11.0-18-generic
  run-parts: executing /etc/kernel/postinst.d/dkms 3.11.0-18-generic /boot/vmlinuz-3.11.0-18-generic
  Error! Bad return status for module build on kernel: 3.11.0-18-generic (x86_64)
  Consult /var/lib/dkms/nvidia-current/319.37/build/make.log for more information.
  run-parts: executing /etc/kernel/postinst.d/initramfs-tools 3.11.0-18-generic /boot/vmlinuz-3.11.0-18-generic
  update-initramfs: Generating /boot/initrd.img-3.11.0-18-generic
  E: /usr/share/initramfs-tools/hooks/fuse failed with return 1.
  update-initramfs: failed for /boot/initrd.img-3.11.0-18-generic with 1.
  run-parts: /etc/kernel/postinst.d/initramfs-tools exited with return code 1
  Failed to process /etc/kernel/postinst.d at /var/lib/dpkg/info/linux-image-3.11.0-18-generic.postinst line 1010.
  dpkg: error processing linux-image-3.11.0-18-generic (--configure):
   subprocess installed post-installation script returned error exit status 2
  Setting up linux-image-3.8.0-36-generic (3.8.0-36.52~precise1) ...
  Running depmod.
  update-initramfs: deferring update (hook will be called later)
  The link /initrd.img is a dangling linkto /boot/initrd.img-3.11.0-18-generic
  Examining /etc/kernel/postinst.d.
  run-parts: executing /etc/kernel/postinst.d/apt-auto-removal 3.8.0-36-generic /boot/vmlinuz-3.8.0-36-generic
  run-parts: executing /etc/kernel/postinst.d/dkms 3.8.0-36-generic /boot/vmlinuz-3.8.0-36-generic
  run-parts: executing /etc/kernel/postinst.d/initramfs-tools 3.8.0-36-generic /boot/vmlinuz-3.8.0-36-generic
  update-initramfs: Generating /boot/initrd.img-3.8.0-36-generic
  E: /usr/share/initramfs-tools/hooks/fuse failed with return 1.
  update-initramfs: failed for /boot/initrd.img-3.8.0-36-generic with 1.
  run-parts: /etc/kernel/postinst.d/initramfs-tools exited with return code 1
  Failed to process /etc/kernel/postinst.d at /var/lib/dpkg/info/linux-image-3.8.0-36-generic.postinst line 1010.
  dpkg: error processing linux-image-3.8.0-36-generic (--configure):
   subprocess installed post-installation script returned error exit status 2
  Setting up linux-image-3.8.0-37-generic (3.8.0-37.53~precise1) ...
  Running depmod.
  update-initramfs: deferring update (hook will be called later)
  The link /initrd.img is a dangling linkto /boot/initrd.img-3.8.0-36-generic
  Examining /etc/kernel/postinst.d.
  run-parts: executing /etc/kernel/postinst.d/apt-auto-removal 3.8.0-37-generic /boot/vmlinuz-3.8.0-37-generic
  run-parts: executing /etc/kernel/postinst.d/dkms 3.8.0-37-generic /boot/vmlinuz-3.8.0-37-generic
  run-parts: executing /etc/kernel/postinst.d/initramfs-tools 3.8.0-37-generic /boot/vmlinuz-3.8.0-37-generic
  update-initramfs: Generating /boot/initrd.img-3.8.0-37-generic
  E: /usr/share/initramfs-tools/hooks/fuse failed with return 1.
  update-initramfs: failed for /boot/initrd.img-3.8.0-37-generic with 1.
  run-parts: /etc/kernel/postinst.d/initramfs-tools exited with return code 1
  Failed to process /etc/kernel/postinst.d at /var/lib/dpkg/info/linux-image-3.8.0-37-generic.postinst line 1010.
  dpkg: error processing linux-image-3.8.0-37-generic (--configure):
   subprocess installed post-installation script returned error exit status 2
  No apport report written because MaxReports has already been reached
                                                                      dpkg: dependency problems prevent configuration of linux-image-generic-lts-saucy:
   linux-image-generic-lts-saucy depends on linux-image-3.11.0-17-generic; however:
    Package linux-image-3.11.0-17-generic is not configured yet.
  dpkg: error processing linux-image-generic-lts-saucy (--configure):
   dependency problems - leaving unconfigured
  No apport report written because MaxReports has already been reached
                                                                      dpkg: dependency problems prevent configuration of linux-signed-image-3.8.0-37-generic:
   linux-signed-image-3.8.0-37-generic depends on linux-image-3.8.0-37-generic (= 3.8.0-37.53~precise1); however:
    Package linux-image-3.8.0-37-generic is not configured yet.
  dpkg: error processing linux-signed-image-3.8.0-37-generic (--configure):
   dependency problems - leaving unconfigured
  No apport report written because MaxReports has already been reached
                                                                      dpkg: dependency problems prevent configuration of linux-signed-image-3.8.0-36-generic:
   linux-signed-image-3.8.0-36-generic depends on linux-image-3.8.0-36-generic (= 3.8.0-36.52~precise1); however:
    Package linux-image-3.8.0-36-generic is not configured yet.
  dpkg: error processing linux-signed-image-3.8.0-36-generic (--configure):
   dependency problems - leaving unconfigured
  No apport report written because MaxReports has already been reached
                                                                      dpkg: dependency problems prevent configuration of linux-signed-image-generic-lts-raring:
   linux-signed-image-generic-lts-raring depends on linux-signed-image-3.8.0-36-generic; however:
    Package linux-signed-image-3.8.0-36-generic is not configured yet.
  dpkg: error processing linux-signed-image-generic-lts-raring (--configure):
   dependency problems - leaving unconfigured
  dpkg: dependency problems prevent configuration of linux-signed-generic-lts-raring:
   linux-signed-generic-lts-raring depends on linux-signed-image-generic-lts-raring; however:
    Package linux-signed-image-generic-lts-raring is not configured yet.No apport report written because MaxReports has already been reached

  dpkg: error processing linux-signed-generic-lts-raring (--configure):
   dependency problems - leaving unconfigured
  No apport report written because MaxReports has already been reached
                                                                      Errors were encountered while processing:
   linux-image-3.11.0-17-generic
   linux-image-3.11.0-18-generic
   linux-image-3.8.0-36-generic
   linux-image-3.8.0-37-generic
   linux-image-generic-lts-saucy
   linux-signed-image-3.8.0-37-generic
   linux-signed-image-3.8.0-36-generic
   linux-signed-image-generic-lts-raring
   linux-signed-generic-lts-raring
  E: Sub-process /usr/bin/dpkg returned an error code (1)

  ProblemType: Package
  DistroRelease: Ubuntu 12.04
  Package: linux-image-3.8.0-37-generic 3.8.0-37.53~precise1
  ProcVersionSignature: Ubuntu 3.11.0-15.25~precise1-generic 3.11.10
  Uname: Linux 3.11.0-15-generic x86_64
  ApportVersion: 2.0.1-0ubuntu17.6
  Architecture: amd64
  Date: Sun Mar 16 08:18:15 2014
  DuplicateSignature: package:linux-image-3.8.0-37-generic:3.8.0-37.53~precise1:run-parts: /etc/kernel/postinst.d/initramfs-tools exited with return code 1
  ErrorMessage: run-parts: /etc/kernel/postinst.d/initramfs-tools exited with return code 1
  InstallationMedia: Ubuntu 12.04.3 LTS "Precise Pangolin" - Release amd64 (20130820.1)
  MarkForUpload: True
  SourcePackage: initramfs-tools
  Title: package linux-image-3.8.0-37-generic 3.8.0-37.53~precise1 failed to install/upgrade: run-parts: /etc/kernel/postinst.d/initramfs-tools exited with return code 1
  UpgradeStatus: No upgrade log present (probably fresh install)

To manage notifications about this bug go to:
https://bugs.launchpad.net/ubuntu/+source/initramfs-tools/+bug/1293041/+subscriptions



More information about the foundations-bugs mailing list