[Bug 1251930]
Clyon
1251930 at bugs.launchpad.net
Fri Jan 17 11:57:33 UTC 2014
Author: clyon
Date: Fri Jan 17 11:57:02 2014
New Revision: 206707
URL: http://gcc.gnu.org/viewcvs?rev=206707&root=gcc&view=rev
Log:
2014-01-17 Charles Baylis <charles.baylis at linaro.org>
Backport from mainline
2013-12-19 Charles Baylis <charles.baylis at linaro.org>
PR target/59142
* config/arm/arm-ldmstm.ml: Use low_register_operand for Thumb
patterns.
* config/arm/ldmstm.md: Regenerate.
2013-12-19 Charles Baylis <charles.baylis at linaro.org>
PR target/59142
* config/arm/predicates.md (arm_hard_general_register_operand):
New predicate.
(arm_hard_register_operand): Remove.
* config/arm/arm-ldmstm.ml: Use arm_hard_general_register_operand
for all patterns.
* config/arm/ldmstm.md: Regenerate.
Modified:
branches/gcc-4_7-branch/ (props changed)
branches/gcc-4_7-branch/gcc/ChangeLog
branches/gcc-4_7-branch/gcc/config/arm/arm-ldmstm.ml
branches/gcc-4_7-branch/gcc/config/arm/ldmstm.md
branches/gcc-4_7-branch/gcc/config/arm/predicates.md
Propchange: branches/gcc-4_7-branch/
('svn:mergeinfo' modified)
--
You received this bug notification because you are a member of Ubuntu
Foundations Bugs, which is subscribed to gcc-4.8 in Ubuntu.
https://bugs.launchpad.net/bugs/1251930
Title:
[4.8 regression] internal compiler error while compiling OpenCV 2.4.7
Status in The GNU Compiler Collection:
Fix Released
Status in Linaro GCC:
Confirmed
Status in “gcc-4.8” package in Ubuntu:
Incomplete
Bug description:
(reported upstream http://gcc.gnu.org/bugzilla/show_bug.cgi?id=59142)
This is on an ARM platform with Ubuntu/Linaro 13.10 with:
g++-4.8:
Installed: 4.8.1-10ubuntu8
While building OpenCV 2.4.7 with:
cmake -D CMAKE_BUILD_TYPE=RELEASE -D CMAKE_INSTALL_PREFIX=/home/jm/fidelio/3rd-party/opencv/2.4.7/linaro ..
make
I got:
[ 71%] Building CXX object modules/ocl/CMakeFiles/opencv_ocl.dir/src/imgproc.cpp.o
/home/jm/fidelio/3rd-party/opencv/2.4.7/opencv-2.4.7/modules/ocl/src/imgproc.cpp: In function ‘void cv::ocl::copyMakeBorder(const cv::ocl::oclMat&, cv::ocl::oclMat&, int, int, int, int, int, const Scalar&)’:
/home/jm/fidelio/3rd-party/opencv/2.4.7/opencv-2.4.7/modules/ocl/src/imgproc.cpp:513:9: internal compiler error: output_operand: invalid expression as operand
}
^
Please submit a full bug report,
with preprocessed source if appropriate.
See <file:///usr/share/doc/gcc-4.8/README.Bugs> for instructions.
Preprocessed source stored into /tmp/ccQku01D.out file, please attach this to your bugreport.
make[2]: *** [modules/ocl/CMakeFiles/opencv_ocl.dir/src/imgproc.cpp.o] Error 1
make[1]: *** [modules/ocl/CMakeFiles/opencv_ocl.dir/all] Error 2
make: *** [all] Error 2
To manage notifications about this bug go to:
https://bugs.launchpad.net/gcc/+bug/1251930/+subscriptions
More information about the foundations-bugs
mailing list